Plate,Plate Group,Well Number,Well,Characteristics [Organism],Term Source 1 REF,Term Source 1 Accession,Characteristics [Cell Line],Term Source 2 REF,Term Source 2 Accession,siRNA Identifier,Antisense Sequence,Sense Sequence,Reagent Design Gene Annotation Build,Gene Identifier,Gene Symbol,Gene Symbol Synonyms,Gene Annotation Comments,Analysis Gene Annotation Build,Control Type,Control Comments,Channels,Comments,Gene Description,Deviation,Overall Strong Inhibitor Gene Hit,Has Phenotype,Phenotype Annotation Level,Phenotype 1,Phenotype 1 Term Name,Phenotype 1 Term Accession,Plate Name,Well Name
2698,305,117,605057,Homo sapiens,NCBITaxon,NCBITaxon_9606,HeLa,EFO,EFO_0001185,SI00307552,UUUCUUUACCAAACCAGCCtg,GGCUGGUUUGGUAAAGAAAtt,"NCBI35, Ensembl release 27, Dec 2004",ENSG00000147416,ATP6V1B2,,Ensembl release 61 gene symbol,"GRCh37, Ensembl release 61, Feb 2011, Gene Symbols from Ensembl release 61 or 81",,,dapi: DNA;vsvg-cfp: CFP-tsO45G ;pm-647: cell surface tsO45G,,"ATPase, H+ transporting, lysosomal V1 subunit B2",1.7617,yes,yes,multiple replicates of reagent,strong inhibition of secretion,strong decrease in rate of protein secretion,CMPO_0000319,0305-02--2007-04-05,e21
2698,305,118,605422,Homo sapiens,NCBITaxon,NCBITaxon_9606,HeLa,EFO,EFO_0001185,SI00307622,UUCAAUUCGGUCUUUGCCCga,GGGCAAAGACCGAAUUGAAtt,"NCBI35, Ensembl release 27, Dec 2004",ENSG00000100554,ATP6V1D,,Ensembl release 61 gene symbol,"GRCh37, Ensembl release 61, Feb 2011, Gene Symbols from Ensembl release 61 or 81",,,dapi: DNA;vsvg-cfp: CFP-tsO45G ;pm-647: cell surface tsO45G,,"ATPase, H+ transporting, lysosomal 34kDa, V1 subunit D",2.4404,yes,yes,multiple replicates of reagent,strong inhibition of secretion,strong decrease in rate of protein secretion,CMPO_0000319,0305-02--2007-04-05,e22
2698,305,119,605429,Homo sapiens,NCBITaxon,NCBITaxon_9606,HeLa,EFO,EFO_0001185,SI03040114,UUCACUCAUGGGCUCAGCGgt,CGCUGAGCCCAUGAGUGAAtt,"NCBI35, Ensembl release 27, Dec 2004",ENSG00000085224,ATRX,,Ensembl release 81 gene symbol added by IDR curator,"GRCh37, Ensembl release 61, Feb 2011, Gene Symbols from Ensembl release 61 or 81",,,dapi: DNA;vsvg-cfp: CFP-tsO45G ;pm-647: cell surface tsO45G,,,,,,,,,,0305-02--2007-04-05,e23
2698,305,120,605309,Homo sapiens,NCBITaxon,NCBITaxon_9606,HeLa,EFO,EFO_0001185,SI00308567,UUCCCAGAUGAUCUGUGCCcg,GGCACAGAUCAUCUGGGAAtt,"NCBI35, Ensembl release 27, Dec 2004",ENSG00000119986,AVPI1,,Ensembl release 81 gene symbol added by IDR curator,"GRCh37, Ensembl release 61, Feb 2011, Gene Symbols from Ensembl release 61 or 81",,,dapi: DNA;vsvg-cfp: CFP-tsO45G ;pm-647: cell surface tsO45G,,,,,,,,,,0305-02--2007-04-05,e24
2698,305,121,605120,Homo sapiens,NCBITaxon,NCBITaxon_9606,HeLa,EFO,EFO_0001185,SI00605304,UAUCACAUCUUAGAACACCgg,GGUGUUCUAAGAUGUGAUAtt,"NCBI35, Ensembl release 27, Dec 2004",ENSG00000167601,AXL,,Ensembl release 61 gene symbol,"GRCh37, Ensembl release 61, Feb 2011, Gene Symbols from Ensembl release 61 or 81",,,dapi: DNA;vsvg-cfp: CFP-tsO45G ;pm-647: cell surface tsO45G,,AXL receptor tyrosine kinase,2.6621,yes,yes,multiple replicates of reagent,strong inhibition of secretion,strong decrease in rate of protein secretion,CMPO_0000319,0305-02--2007-04-05,f1
2698,305,122,605335,Homo sapiens,NCBITaxon,NCBITaxon_9606,HeLa,EFO,EFO_0001185,SI00309120,AUAGAUGGUGGGCAGCUGCgg,GCAGCUGCCCACCAUCUAUtt,"NCBI35, Ensembl release 27, Dec 2004",ENSG00000112309,B3GAT2,,Ensembl release 61 gene symbol,"GRCh37, Ensembl release 61, Feb 2011, Gene Symbols from Ensembl release 61 or 81",,,dapi: DNA;vsvg-cfp: CFP-tsO45G ;pm-647: cell surface tsO45G,,"beta-1,3-glucuronyltransferase 2 (glucuronosyltransferase S)",1.6477,yes,yes,multiple replicates of reagent,strong inhibition of secretion,strong decrease in rate of protein secretion,CMPO_0000319,0305-02--2007-04-05,f2
2698,305,123,605112,Homo sapiens,NCBITaxon,NCBITaxon_9606,HeLa,EFO,EFO_0001185,SI00309162,UUGUCAUCGUCAGCAAAGUag,ACUUUGCUGACGAUGACAAtt,"NCBI35, Ensembl release 27, Dec 2004",ENSG00000149541,B3GAT3,,Ensembl release 81 gene symbol added by IDR curator,"GRCh37, Ensembl release 61, Feb 2011, Gene Symbols from Ensembl release 61 or 81",,,dapi: DNA;vsvg-cfp: CFP-tsO45G ;pm-647: cell surface tsO45G,,,,,,,,,,0305-02--2007-04-05,f3
2698,305,124,605296,Homo sapiens,NCBITaxon,NCBITaxon_9606,HeLa,EFO,EFO_0001185,SI00309575,UAGAACAUGACUUCAAGGCtg,GCCUUGAAGUCAUGUUCUAtt,"NCBI35, Ensembl release 27, Dec 2004",ENSG00000158470,B4GALT5,,Ensembl release 81 gene symbol added by IDR curator,"GRCh37, Ensembl release 61, Feb 2011, Gene Symbols from Ensembl release 61 or 81",,,dapi: DNA;vsvg-cfp: CFP-tsO45G ;pm-647: cell surface tsO45G,,,,,,,,,,0305-02--2007-04-05,f4
2698,305,125,605347,Homo sapiens,NCBITaxon,NCBITaxon_9606,HeLa,EFO,EFO_0001185,SI03150259,UAAAUUGUUCAGUCCAUCGat,CGAUGGACUGAACAAUUUAtt,"NCBI35, Ensembl release 27, Dec 2004",ENSG00000118276,B4GALT6,,Ensembl release 81 gene symbol added by IDR curator,"GRCh37, Ensembl release 61, Feb 2011, Gene Symbols from Ensembl release 61 or 81",,,dapi: DNA;vsvg-cfp: CFP-tsO45G ;pm-647: cell surface tsO45G,,,,,,,,,,0305-02--2007-04-05,f5
2698,305,126,605333,Homo sapiens,NCBITaxon,NCBITaxon_9606,HeLa,EFO,EFO_0001185,Q120368,AAGCUUGAUUGUUUUCCCGtc,CGGGAAAACAAUCAAGCUUtt,"NCBI35, Ensembl release 27, Dec 2004",ENSG00000138069,RAB1A,,Ensembl release 81 gene symbol added by IDR curator,"GRCh37, Ensembl release 61, Feb 2011, Gene Symbols from Ensembl release 61 or 81",,,dapi: DNA;vsvg-cfp: CFP-tsO45G ;pm-647: cell surface tsO45G,,,,,,,,,,0305-02--2007-04-05,f6
2698,305,127,605210,Homo sapiens,NCBITaxon,NCBITaxon_9606,HeLa,EFO,EFO_0001185,SI00288540,UUCAUCAAGACUCUCGUUGag,CAACGAGAGUCUUGAUGAAtt,"NCBI35, Ensembl release 27, Dec 2004",ENSG00000006453,BAIAP2L1,,Ensembl release 81 gene symbol added by IDR curator,"GRCh37, Ensembl release 61, Feb 2011, Gene Symbols from Ensembl release 61 or 81",,,dapi: DNA;vsvg-cfp: CFP-tsO45G ;pm-647: cell surface tsO45G,,,,,,,,,,0305-02--2007-04-05,f7
2698,305,128,605108,Homo sapiens,NCBITaxon,NCBITaxon_9606,HeLa,EFO,EFO_0001185,SI02653259,UUCAAUAUUCACUUCCUCGtc,CGAGGAAGUGAAUAUUGAAtt,"NCBI35, Ensembl release 27, Dec 2004",ENSG00000107949,BCCIP,,Ensembl release 81 gene symbol added by IDR curator,"GRCh37, Ensembl release 61, Feb 2011, Gene Symbols from Ensembl release 61 or 81",,,dapi: DNA;vsvg-cfp: CFP-tsO45G ;pm-647: cell surface tsO45G,,,,,,,,,,0305-02--2007-04-05,f8
2698,305,129,605268,Homo sapiens,NCBITaxon,NCBITaxon_9606,HeLa,EFO,EFO_0001185,SI00134820,UUACAGUUUAACCCACCUCtg,GAGGUGGGUUAAACUGUAAtt,"NCBI35, Ensembl release 27, Dec 2004",ENSG00000127152,BCL11B,,Ensembl release 81 gene symbol added by IDR curator,"GRCh37, Ensembl release 61, Feb 2011, Gene Symbols from Ensembl release 61 or 81",,,dapi: DNA;vsvg-cfp: CFP-tsO45G ;pm-647: cell surface tsO45G,,,,,,,,,,0305-02--2007-04-05,f9
2698,305,130,605107,Homo sapiens,NCBITaxon,NCBITaxon_9606,HeLa,EFO,EFO_0001185,SI00311409,UUUGCCAUUGUUCUCUUCGtt,CGAAGAGAACAAUGGCAAAtt,"NCBI35, Ensembl release 27, Dec 2004",ENSG00000183337,BCOR,,Ensembl release 81 gene symbol added by IDR curator,"GRCh37, Ensembl release 61, Feb 2011, Gene Symbols from Ensembl release 61 or 81",,,dapi: DNA;vsvg-cfp: CFP-tsO45G ;pm-647: cell surface tsO45G,,,,,,,,,,0305-02--2007-04-05,f10
2698,305,131,605084,Homo sapiens,NCBITaxon,NCBITaxon_9606,HeLa,EFO,EFO_0001185,SI00062769,UUAGACUCUAAGUUAAGUUca,AACUUAACUUAGAGUCUAAtt,"NCBI35, Ensembl release 27, Dec 2004",ENSG00000186716,BCR,,Ensembl release 61 gene symbol,"GRCh37, Ensembl release 61, Feb 2011, Gene Symbols from Ensembl release 61 or 81",,,dapi: DNA;vsvg-cfp: CFP-tsO45G ;pm-647: cell surface tsO45G,,breakpoint cluster region,2.1685,yes,yes,multiple replicates of reagent,strong inhibition of secretion,strong decrease in rate of protein secretion,CMPO_0000319,0305-02--2007-04-05,f11
2698,305,132,605054,Homo sapiens,NCBITaxon,NCBITaxon_9606,HeLa,EFO,EFO_0001185,SI02224957,UACGGUGACAUGGUCCGCCcg,GGCGGACCAUGUCACCGUAtt,"NCBI35, Ensembl release 27, Dec 2004",ENSG00000183092,BEGAIN,,Ensembl release 81 gene symbol added by IDR curator,"GRCh37, Ensembl release 61, Feb 2011, Gene Symbols from Ensembl release 61 or 81",,,dapi: DNA;vsvg-cfp: CFP-tsO45G ;pm-647: cell surface tsO45G,,,,,,,,,,0305-02--2007-04-05,f12
2698,305,133,605406,Homo sapiens,NCBITaxon,NCBITaxon_9606,HeLa,EFO,EFO_0001185,SI03165456,UUCACCCUCGAAAUGGUAGtg,CUACCAUUUCGAGGGUGAAtt,"NCBI35, Ensembl release 27, Dec 2004",ENSG00000160783,PMF1,,Ensembl release 81 gene symbol added by IDR curator,"GRCh37, Ensembl release 61, Feb 2011, Gene Symbols from Ensembl release 61 or 81",,,dapi: DNA;vsvg-cfp: CFP-tsO45G ;pm-647: cell surface tsO45G,,,,,,,,,,0305-02--2007-04-05,f13
2698,305,134,605423,Homo sapiens,NCBITaxon,NCBITaxon_9606,HeLa,EFO,EFO_0001185,SI00312067,UUUCAUAUCAGCUUAGACCag,GGUCUAAGCUGAUAUGAAAtt,"NCBI35, Ensembl release 27, Dec 2004",ENSG00000198908,BHLHB9,,Ensembl release 81 gene symbol added by IDR curator,"GRCh37, Ensembl release 61, Feb 2011, Gene Symbols from Ensembl release 61 or 81",,,dapi: DNA;vsvg-cfp: CFP-tsO45G ;pm-647: cell surface tsO45G,,,,,,,,,,0305-02--2007-04-05,f14
2698,305,135,605395,Homo sapiens,NCBITaxon,NCBITaxon_9606,HeLa,EFO,EFO_0001185,Q103860,CCGUAUCGUAAGCAGUACUtt,AGUACUGCUUACGAUACGGtt,"NCBI35, Ensembl release 27, Dec 2004",,,,no perfect match to a gene transcript in Ensembl 61,"GRCh37, Ensembl release 61, Feb 2011, Gene Symbols from Ensembl release 61 or 81",,,dapi: DNA;vsvg-cfp: CFP-tsO45G ;pm-647: cell surface tsO45G,,,,,,,,,,0305-02--2007-04-05,f15
2698,305,136,605260,Homo sapiens,NCBITaxon,NCBITaxon_9606,HeLa,EFO,EFO_0001185,SI03067176,UUGAAAUCAAUAACCGCGCtg,GCGCGGUUAUUGAUUUCAAtt,"NCBI35, Ensembl release 27, Dec 2004",ENSG00000163098,BIRC8,,Ensembl release 81 gene symbol added by IDR curator,"GRCh37, Ensembl release 61, Feb 2011, Gene Symbols from Ensembl release 61 or 81",,,dapi: DNA;vsvg-cfp: CFP-tsO45G ;pm-647: cell surface tsO45G,,,,,,,,,,0305-02--2007-04-05,f16
2698,305,137,605349,Homo sapiens,NCBITaxon,NCBITaxon_9606,HeLa,EFO,EFO_0001185,SI00023380,UUGAGUGAUAUCUUUAGACag,GUCUAAAGAUAUCACUCAAtt,"NCBI35, Ensembl release 27, Dec 2004",ENSG00000152785,BMP3,,Ensembl release 81 gene symbol added by IDR curator,"GRCh37, Ensembl release 61, Feb 2011, Gene Symbols from Ensembl release 61 or 81",,,dapi: DNA;vsvg-cfp: CFP-tsO45G ;pm-647: cell surface tsO45G,,,,,,,,,,0305-02--2007-04-05,f17
2698,305,138,605425,Homo sapiens,NCBITaxon,NCBITaxon_9606,HeLa,EFO,EFO_0001185,SI00106974,UACCCUUGAGCUUCUAACCgt,GGUUAGAAGCUCAAGGGUAtt,"NCBI35, Ensembl release 27, Dec 2004",ENSG00000100425,BRD1,,Ensembl release 81 gene symbol added by IDR curator,"GRCh37, Ensembl release 61, Feb 2011, Gene Symbols from Ensembl release 61 or 81",,,dapi: DNA;vsvg-cfp: CFP-tsO45G ;pm-647: cell surface tsO45G,,,,,,,,,,0305-02--2007-04-05,f18
2698,305,139,605060,Homo sapiens,NCBITaxon,NCBITaxon_9606,HeLa,EFO,EFO_0001185,SI00313285,UUUCUUUGGUUUGUUCUGCtg,GCAGAACAAACCAAAGAAAtt,"NCBI35, Ensembl release 27, Dec 2004",ENSG00000141867,BRD4,,Ensembl release 81 gene symbol added by IDR curator,"GRCh37, Ensembl release 61, Feb 2011, Gene Symbols from Ensembl release 61 or 81",,,dapi: DNA;vsvg-cfp: CFP-tsO45G ;pm-647: cell surface tsO45G,,,,,,,,,,0305-02--2007-04-05,f19
2698,305,140,605137,Homo sapiens,NCBITaxon,NCBITaxon_9606,HeLa,EFO,EFO_0001185,SI00313327,UUUAAACUUAUCUUCAAGCat,GCUUGAAGAUAAGUUUAAAtt,"NCBI35, Ensembl release 27, Dec 2004",ENSG00000166164,BRD7,,Ensembl release 61 gene symbol,"GRCh37, Ensembl release 61, Feb 2011, Gene Symbols from Ensembl release 61 or 81",,,dapi: DNA;vsvg-cfp: CFP-tsO45G ;pm-647: cell surface tsO45G,,bromodomain containing 7,1.1243,yes,yes,multiple replicates of reagent,strong inhibition of secretion,strong decrease in rate of protein secretion,CMPO_0000319,0305-02--2007-04-05,f20
2698,305,141,605339,Homo sapiens,NCBITaxon,NCBITaxon_9606,HeLa,EFO,EFO_0001185,SI00313901,UUUGUUUGUAUUAGUAACGca,CGUUACUAAUACAAACAAAtt,"NCBI35, Ensembl release 27, Dec 2004",ENSG00000148411,NACC2,,Ensembl release 81 gene symbol added by IDR curator,"GRCh37, Ensembl release 61, Feb 2011, Gene Symbols from Ensembl release 61 or 81",,,dapi: DNA;vsvg-cfp: CFP-tsO45G ;pm-647: cell surface tsO45G,,,,,,,,,,0305-02--2007-04-05,f21
2698,305,142,605216,Homo sapiens,NCBITaxon,NCBITaxon_9606,HeLa,EFO,EFO_0001185,Q24546,AUUAGGAUGUUGAAGAUCCtt,GGAUCUUCAACAUCCUAAUtt,"NCBI35, Ensembl release 27, Dec 2004",,,,"siRNA original target COPB1, siRNA matched to multiple genes (ENSG00000129083;ENSG00000129084)","GRCh37, Ensembl release 61, Feb 2011, Gene Symbols from Ensembl release 61 or 81",positive control,,dapi: DNA;vsvg-cfp: CFP-tsO45G ;pm-647: cell surface tsO45G,,,,,,,,,,0305-02--2007-04-05,f22
2698,305,143,605275,Homo sapiens,NCBITaxon,NCBITaxon_9606,HeLa,EFO,EFO_0001185,SI03209178,UUUGACUCCUAGACGGAGCag,GCUCCGUCUAGGAGUCAAAtt,"NCBI35, Ensembl release 27, Dec 2004",ENSG00000011114,BTBD7,,Ensembl release 81 gene symbol added by IDR curator,"GRCh37, Ensembl release 61, Feb 2011, Gene Symbols from Ensembl release 61 or 81",,,dapi: DNA;vsvg-cfp: CFP-tsO45G ;pm-647: cell surface tsO45G,,,,,,,,,,0305-02--2007-04-05,f23
2698,305,144,605163,Homo sapiens,NCBITaxon,NCBITaxon_9606,HeLa,EFO,EFO_0001185,SI00094080,UUUCUUUCUGAACUGAGUCtt,GACUCAGUUCAGAAAGAAAtt,"NCBI35, Ensembl release 27, Dec 2004",ENSG00000026950,BTN3A1,,Ensembl release 81 gene symbol added by IDR curator,"GRCh37, Ensembl release 61, Feb 2011, Gene Symbols from Ensembl release 61 or 81",,,dapi: DNA;vsvg-cfp: CFP-tsO45G ;pm-647: cell surface tsO45G,,,,,,,,,,0305-02--2007-04-05,f24
2698,305,145,605176,Homo sapiens,NCBITaxon,NCBITaxon_9606,HeLa,EFO,EFO_0001185,SI00605010,UCACAUAUUAGGUAUUCUCgt,GAGAAUACCUAAUAUGUGAtt,"NCBI35, Ensembl release 27, Dec 2004",ENSG00000156970,BUB1B,,Ensembl release 61 gene symbol,"GRCh37, Ensembl release 61, Feb 2011, Gene Symbols from Ensembl release 61 or 81",,,dapi: DNA;vsvg-cfp: CFP-tsO45G ;pm-647: cell surface tsO45G,,BUB1 budding uninhibited by benzimidazoles 1 homolog beta (yeast),1.7952,yes,yes,multiple replicates of reagent,strong inhibition of secretion,strong decrease in rate of protein secretion,CMPO_0000319,0305-02--2007-04-05,g1
2698,305,146,605136,Homo sapiens,NCBITaxon,NCBITaxon_9606,HeLa,EFO,EFO_0001185,SI03103436,UCAAUUGAUGAUCUAGUCCtc,GGACUAGAUCAUCAAUUGAtt,"NCBI35, Ensembl release 27, Dec 2004",ENSG00000154473,BUB3,,Ensembl release 61 gene symbol,"GRCh37, Ensembl release 61, Feb 2011, Gene Symbols from Ensembl release 61 or 81",,,dapi: DNA;vsvg-cfp: CFP-tsO45G ;pm-647: cell surface tsO45G,,BUB3 budding uninhibited by benzimidazoles 3 homolog (yeast),2.6025,yes,yes,multiple replicates of reagent,strong inhibition of secretion,strong decrease in rate of protein secretion,CMPO_0000319,0305-02--2007-04-05,g2
2698,305,147,605249,Homo sapiens,NCBITaxon,NCBITaxon_9606,HeLa,EFO,EFO_0001185,SI00423024,UUCUGUUUCAGCUUCUCUCat,GAGAGAAGCUGAAACAGAAtt,"NCBI35, Ensembl release 27, Dec 2004",ENSG00000106245,BUD31,,Ensembl release 81 gene symbol added by IDR curator,"GRCh37, Ensembl release 61, Feb 2011, Gene Symbols from Ensembl release 61 or 81",,,dapi: DNA;vsvg-cfp: CFP-tsO45G ;pm-647: cell surface tsO45G,,,,,,,,,,0305-02--2007-04-05,g3
2698,305,148,605362,Homo sapiens,NCBITaxon,NCBITaxon_9606,HeLa,EFO,EFO_0001185,SI00705355,UUCAUUAAUAACAAUCAGGtc,CCUGAUUGUUAUUAAUGAAtt,"NCBI35, Ensembl release 27, Dec 2004",ENSG00000117133,RPF1,,Ensembl release 81 gene symbol added by IDR curator,"GRCh37, Ensembl release 61, Feb 2011, Gene Symbols from Ensembl release 61 or 81",,,dapi: DNA;vsvg-cfp: CFP-tsO45G ;pm-647: cell surface tsO45G,,,,,,,,,,0305-02--2007-04-05,g4
2698,305,149,605399,Homo sapiens,NCBITaxon,NCBITaxon_9606,HeLa,EFO,EFO_0001185,SI00481663,UUGCUCUGCUACAAGCUCCtc,GGAGCUUGUAGCAGAGCAAtt,"NCBI35, Ensembl release 27, Dec 2004",ENSG00000082153,BZW1,,Ensembl release 81 gene symbol added by IDR curator,"GRCh37, Ensembl release 61, Feb 2011, Gene Symbols from Ensembl release 61 or 81",,,dapi: DNA;vsvg-cfp: CFP-tsO45G ;pm-647: cell surface tsO45G,,,,,,,,,,0305-02--2007-04-05,g5
2698,305,150,605287,Homo sapiens,NCBITaxon,NCBITaxon_9606,HeLa,EFO,EFO_0001185,SI00315364,UUGUUUGGUAAUGAAACUCtt,GAGUUUCAUUACCAAACAAtt,"NCBI35, Ensembl release 27, Dec 2004",ENSG00000107938,EDRF1,,Ensembl release 81 gene symbol added by IDR curator,"GRCh37, Ensembl release 61, Feb 2011, Gene Symbols from Ensembl release 61 or 81",,,dapi: DNA;vsvg-cfp: CFP-tsO45G ;pm-647: cell surface tsO45G,,,,,,,,,,0305-02--2007-04-05,g6
2698,305,151,605389,Homo sapiens,NCBITaxon,NCBITaxon_9606,HeLa,EFO,EFO_0001185,SI00315630,UUCAGGAAGGUGAUCUGCGgt,CGCAGAUCACCUUCCUGAAtt,"NCBI35, Ensembl release 27, Dec 2004",ENSG00000119943,PYROXD2,,Ensembl release 61 gene symbol,"GRCh37, Ensembl release 61, Feb 2011, Gene Symbols from Ensembl release 61 or 81",,,dapi: DNA;vsvg-cfp: CFP-tsO45G ;pm-647: cell surface tsO45G,,,,,,,,,,0305-02--2007-04-05,g7
2698,305,152,605081,Homo sapiens,NCBITaxon,NCBITaxon_9606,HeLa,EFO,EFO_0001185,SI00316218,UUUAUAGCUGAAAUGCUGCag,GCAGCAUUUCAGCUAUAAAtt,"NCBI35, Ensembl release 27, Dec 2004",ENSG00000119977,TCTN3,,Ensembl release 81 gene symbol added by IDR curator,"GRCh37, Ensembl release 61, Feb 2011, Gene Symbols from Ensembl release 61 or 81",,,dapi: DNA;vsvg-cfp: CFP-tsO45G ;pm-647: cell surface tsO45G,,,,,,,,,,0305-02--2007-04-05,g8
2698,305,153,605282,Homo sapiens,NCBITaxon,NCBITaxon_9606,HeLa,EFO,EFO_0001185,SI00316512,UUGGUCAUGUGCUUGGCCCtg,GGGCCAAGCACAUGACCAAtt,"NCBI35, Ensembl release 27, Dec 2004",ENSG00000172538,FAM170B,,Ensembl release 81 gene symbol added by IDR curator,"GRCh37, Ensembl release 61, Feb 2011, Gene Symbols from Ensembl release 61 or 81",,,dapi: DNA;vsvg-cfp: CFP-tsO45G ;pm-647: cell surface tsO45G,,,,,,,,,,0305-02--2007-04-05,g9
2698,305,154,605229,Homo sapiens,NCBITaxon,NCBITaxon_9606,HeLa,EFO,EFO_0001185,SI00316617,UUGCCUUUCAAUUUGGUCCtt,GGACCAAAUUGAAAGGCAAtt,"NCBI35, Ensembl release 27, Dec 2004",ENSG00000197748,CFAP43,,Ensembl release 81 gene symbol added by IDR curator,"GRCh37, Ensembl release 61, Feb 2011, Gene Symbols from Ensembl release 61 or 81",,,dapi: DNA;vsvg-cfp: CFP-tsO45G ;pm-647: cell surface tsO45G,,,,,,,,,,0305-02--2007-04-05,g10
2698,305,155,605076,Homo sapiens,NCBITaxon,NCBITaxon_9606,HeLa,EFO,EFO_0001185,SI00316883,UUAAUGAAGAGACUCUUGCgt,GCAAGAGUCUCUUCAUUAAtt,"NCBI35, Ensembl release 27, Dec 2004",ENSG00000108100,CCNY,,Ensembl release 61 gene symbol,"GRCh37, Ensembl release 61, Feb 2011, Gene Symbols from Ensembl release 61 or 81",,,dapi: DNA;vsvg-cfp: CFP-tsO45G ;pm-647: cell surface tsO45G,,cyclin Y,1.8735,yes,yes,multiple replicates of reagent,strong inhibition of secretion,strong decrease in rate of protein secretion,CMPO_0000319,0305-02--2007-04-05,g11
2698,305,156,605411,Homo sapiens,NCBITaxon,NCBITaxon_9606,HeLa,EFO,EFO_0001185,SI00317114,UAGCUGUGACCGGUCAUGGtg,CCAUGACCGGUCACAGCUAtt,"NCBI35, Ensembl release 27, Dec 2004",ENSG00000188373,C10orf99,,Ensembl release 81 gene symbol added by IDR curator,"GRCh37, Ensembl release 61, Feb 2011, Gene Symbols from Ensembl release 61 or 81",,,dapi: DNA;vsvg-cfp: CFP-tsO45G ;pm-647: cell surface tsO45G,,,,,,,,,,0305-02--2007-04-05,g12
2698,305,157,605372,Homo sapiens,NCBITaxon,NCBITaxon_9606,HeLa,EFO,EFO_0001185,SI00417242,UUGUAUUGAGUAUAUGUUCtt,GAACAUAUACUCAAUACAAtt,"NCBI35, Ensembl release 27, Dec 2004",ENSG00000196559,C11orf55,,Ensembl release 61 gene symbol,"GRCh37, Ensembl release 61, Feb 2011, Gene Symbols from Ensembl release 61 or 81",,,dapi: DNA;vsvg-cfp: CFP-tsO45G ;pm-647: cell surface tsO45G,,chromosome 11 open reading frame 55,2.2521,yes,yes,multiple replicates of reagent,strong inhibition of secretion,strong decrease in rate of protein secretion,CMPO_0000319,0305-02--2007-04-05,g13
2698,305,158,605213,Homo sapiens,NCBITaxon,NCBITaxon_9606,HeLa,EFO,EFO_0001185,SI00401723,UUUCAUAUGAAACUCAAAGta,CUUUGAGUUUCAUAUGAAAtt,"NCBI35, Ensembl release 27, Dec 2004",ENSG00000120458,C11orf61,MSANTD2,Ensembl release 61 gene symbol,"GRCh37, Ensembl release 61, Feb 2011, Gene Symbols from Ensembl release 61 or 81",,,dapi: DNA;vsvg-cfp: CFP-tsO45G ;pm-647: cell surface tsO45G,,chromosome 11 open reading frame 61,2.1781,yes,yes,multiple replicates of reagent,strong inhibition of secretion,strong decrease in rate of protein secretion,CMPO_0000319,0305-02--2007-04-05,g14
2698,305,159,605363,Homo sapiens,NCBITaxon,NCBITaxon_9606,HeLa,EFO,EFO_0001185,Q24546,AUUAGGAUGUUGAAGAUCCtt,GGAUCUUCAACAUCCUAAUtt,"NCBI35, Ensembl release 27, Dec 2004",,,,"siRNA original target COPB1, siRNA matched to multiple genes (ENSG00000129083;ENSG00000129084)","GRCh37, Ensembl release 61, Feb 2011, Gene Symbols from Ensembl release 61 or 81",positive control,,dapi: DNA;vsvg-cfp: CFP-tsO45G ;pm-647: cell surface tsO45G,,,,,,,,,,0305-02--2007-04-05,g15
2698,305,160,605079,Homo sapiens,NCBITaxon,NCBITaxon_9606,HeLa,EFO,EFO_0001185,SI00640843,AAACUGUUUAAAUUCAUCCat,GGAUGAAUUUAAACAGUUUtt,"NCBI35, Ensembl release 27, Dec 2004",,,,no perfect match to a gene transcript in Ensembl 61,"GRCh37, Ensembl release 61, Feb 2011, Gene Symbols from Ensembl release 61 or 81",,,dapi: DNA;vsvg-cfp: CFP-tsO45G ;pm-647: cell surface tsO45G,,,,,,,,,,0305-02--2007-04-05,g16
2698,305,161,605385,Homo sapiens,NCBITaxon,NCBITaxon_9606,HeLa,EFO,EFO_0001185,SI03220161,UAGGAGAUCGGGUUCAACGgc,CGUUGAACCCGAUCUCCUAtt,"NCBI35, Ensembl release 27, Dec 2004",ENSG00000180425,C11orf71,,Ensembl release 81 gene symbol added by IDR curator,"GRCh37, Ensembl release 61, Feb 2011, Gene Symbols from Ensembl release 61 or 81",,,dapi: DNA;vsvg-cfp: CFP-tsO45G ;pm-647: cell surface tsO45G,,,,,,,,,,0305-02--2007-04-05,g17
2698,305,162,605272,Homo sapiens,NCBITaxon,NCBITaxon_9606,HeLa,EFO,EFO_0001185,SI00395507,UAAUAAAUAUACAAGUUUGgg,CAAACUUGUAUAUUUAUUAtt,"NCBI35, Ensembl release 27, Dec 2004",ENSG00000139438,FAM222A,,Ensembl release 81 gene symbol added by IDR curator,"GRCh37, Ensembl release 61, Feb 2011, Gene Symbols from Ensembl release 61 or 81",,,dapi: DNA;vsvg-cfp: CFP-tsO45G ;pm-647: cell surface tsO45G,,,,,,,,,,0305-02--2007-04-05,g18
2698,305,163,605286,Homo sapiens,NCBITaxon,NCBITaxon_9606,HeLa,EFO,EFO_0001185,SI00391587,UUGACCGUCCACACUUCCCat,GGGAAGUGUGGACGGUCAAtt,"NCBI35, Ensembl release 27, Dec 2004",ENSG00000123395,ATG101,,Ensembl release 81 gene symbol added by IDR curator,"GRCh37, Ensembl release 61, Feb 2011, Gene Symbols from Ensembl release 61 or 81",,,dapi: DNA;vsvg-cfp: CFP-tsO45G ;pm-647: cell surface tsO45G,,,,,,,,,,0305-02--2007-04-05,g19
2698,305,164,605190,Homo sapiens,NCBITaxon,NCBITaxon_9606,HeLa,EFO,EFO_0001185,SI00317800,UUAAAUAUGAUUUGAAAUCta,GAUUUCAAAUCAUAUUUAAtt,"NCBI35, Ensembl release 27, Dec 2004",ENSG00000102445,C13orf18,KIAA0226L,Ensembl release 61 gene symbol,"GRCh37, Ensembl release 61, Feb 2011, Gene Symbols from Ensembl release 61 or 81",,,dapi: DNA;vsvg-cfp: CFP-tsO45G ;pm-647: cell surface tsO45G,,chromosome 13 open reading frame 18,1.154,yes,yes,multiple replicates of reagent,strong inhibition of secretion,strong decrease in rate of protein secretion,CMPO_0000319,0305-02--2007-04-05,g20
2698,305,165,605346,Homo sapiens,NCBITaxon,NCBITaxon_9606,HeLa,EFO,EFO_0001185,SI03246005,UACCAUUCAAUGAAGAACCaa,GGUUCUUCAUUGAAUGGUAtt,"NCBI35, Ensembl release 27, Dec 2004",ENSG00000050130,JKAMP,,Ensembl release 81 gene symbol added by IDR curator,"GRCh37, Ensembl release 61, Feb 2011, Gene Symbols from Ensembl release 61 or 81",,,dapi: DNA;vsvg-cfp: CFP-tsO45G ;pm-647: cell surface tsO45G,,,,,,,,,,0305-02--2007-04-05,g21
2698,305,166,605231,Homo sapiens,NCBITaxon,NCBITaxon_9606,HeLa,EFO,EFO_0001185,Q103860,CCGUAUCGUAAGCAGUACUtt,AGUACUGCUUACGAUACGGtt,"NCBI35, Ensembl release 27, Dec 2004",,,,no perfect match to a gene transcript in Ensembl 61,"GRCh37, Ensembl release 61, Feb 2011, Gene Symbols from Ensembl release 61 or 81",,,dapi: DNA;vsvg-cfp: CFP-tsO45G ;pm-647: cell surface tsO45G,,,,,,,,,,0305-02--2007-04-05,g22