Plate,Plate Group,Well Number,Well,Characteristics [Organism],Term Source 1 REF,Term Source 1 Accession,Characteristics [Cell Line],Term Source 2 REF,Term Source 2 Accession,siRNA Identifier,Antisense Sequence,Sense Sequence,Reagent Design Gene Annotation Build,Gene Identifier,Gene Symbol,Gene Symbol Synonyms,Gene Annotation Comments,Analysis Gene Annotation Build,Control Type,Control Comments,Channels,Comments,Gene Description,Deviation,Overall Strong Inhibitor Gene Hit,Has Phenotype,Phenotype Annotation Level,Phenotype 1,Phenotype 1 Term Name,Phenotype 1 Term Accession,Plate Name,Well Name
2700,305,349,606165,Homo sapiens,NCBITaxon,NCBITaxon_9606,HeLa,EFO,EFO_0001185,SI00356937,UUUAUCACUAAUAAUAUGGgt,CCAUAUUAUUAGUGAUAAAtt,"NCBI35, Ensembl release 27, Dec 2004",ENSG00000139842,CUL4A,,Ensembl release 61 gene symbol,"GRCh37, Ensembl release 61, Feb 2011, Gene Symbols from Ensembl release 61 or 81",,,dapi: DNA;vsvg-cfp: CFP-tsO45G ;pm-647: cell surface tsO45G,,cullin 4A,1.6096,yes,yes,multiple replicates of reagent,strong inhibition of secretion,strong decrease in rate of protein secretion,CMPO_0000319,0305-05--2007-04-04,o13
2700,305,350,606010,Homo sapiens,NCBITaxon,NCBITaxon_9606,HeLa,EFO,EFO_0001185,SI00357028,UUACCUUUAGGGAAUAUUCtg,GAAUAUUCCCUAAAGGUAAtt,"NCBI35, Ensembl release 27, Dec 2004",ENSG00000119929,CUTC,,Ensembl release 81 gene symbol added by IDR curator,"GRCh37, Ensembl release 61, Feb 2011, Gene Symbols from Ensembl release 61 or 81",,,dapi: DNA;vsvg-cfp: CFP-tsO45G ;pm-647: cell surface tsO45G,,,,,,,,,,0305-05--2007-04-04,o14
2700,305,351,606128,Homo sapiens,NCBITaxon,NCBITaxon_9606,HeLa,EFO,EFO_0001185,Q120368,AAGCUUGAUUGUUUUCCCGtc,CGGGAAAACAAUCAAGCUUtt,"NCBI35, Ensembl release 27, Dec 2004",ENSG00000138069,RAB1A,,Ensembl release 81 gene symbol added by IDR curator,"GRCh37, Ensembl release 61, Feb 2011, Gene Symbols from Ensembl release 61 or 81",,,dapi: DNA;vsvg-cfp: CFP-tsO45G ;pm-647: cell surface tsO45G,,,,,,,,,,0305-05--2007-04-04,o15
2700,305,352,606043,Homo sapiens,NCBITaxon,NCBITaxon_9606,HeLa,EFO,EFO_0001185,SI03023447,UAAAGCACUGGAACCAAAGaa,CUUUGGUUCCAGUGCUUUAtt,"NCBI35, Ensembl release 27, Dec 2004",ENSG00000154639,CXADR,,Ensembl release 61 gene symbol,"GRCh37, Ensembl release 61, Feb 2011, Gene Symbols from Ensembl release 61 or 81",,,dapi: DNA;vsvg-cfp: CFP-tsO45G ;pm-647: cell surface tsO45G,,coxsackie virus and adenovirus receptor,1.2128,yes,yes,multiple replicates of reagent,strong inhibition of secretion,strong decrease in rate of protein secretion,CMPO_0000319,0305-05--2007-04-04,o16
2700,305,353,605900,Homo sapiens,NCBITaxon,NCBITaxon_9606,HeLa,EFO,EFO_0001185,SI02623943,UUUAGCUUCGGGUCAAUGCac,GCAUUGACCCGAAGCUAAAtt,"NCBI35, Ensembl release 27, Dec 2004",ENSG00000107562,CXCL12,,Ensembl release 81 gene symbol added by IDR curator,"GRCh37, Ensembl release 61, Feb 2011, Gene Symbols from Ensembl release 61 or 81",,,dapi: DNA;vsvg-cfp: CFP-tsO45G ;pm-647: cell surface tsO45G,,,,,,,,,,0305-05--2007-04-04,o17
2700,305,354,606126,Homo sapiens,NCBITaxon,NCBITaxon_9606,HeLa,EFO,EFO_0001185,SI00088256,UAGGACUUAAUUCUCCUCCgt,GGAGGAGAAUUAAGUCCUAtt,"NCBI35, Ensembl release 27, Dec 2004",ENSG00000156234,CXCL13,,Ensembl release 81 gene symbol added by IDR curator,"GRCh37, Ensembl release 61, Feb 2011, Gene Symbols from Ensembl release 61 or 81",,,dapi: DNA;vsvg-cfp: CFP-tsO45G ;pm-647: cell surface tsO45G,,,,,,,,,,0305-05--2007-04-04,o18
2700,305,355,606119,Homo sapiens,NCBITaxon,NCBITaxon_9606,HeLa,EFO,EFO_0001185,SI00357392,UUCAAUACGCAGCCUCUGCag,GCAGAGGCUGCGUAUUGAAtt,"NCBI35, Ensembl release 27, Dec 2004",ENSG00000177854,TMEM187,,Ensembl release 61 gene symbol,"GRCh37, Ensembl release 61, Feb 2011, Gene Symbols from Ensembl release 61 or 81",,,dapi: DNA;vsvg-cfp: CFP-tsO45G ;pm-647: cell surface tsO45G,,transmembrane protein 187,1.9957,yes,yes,multiple replicates of reagent,strong inhibition of secretion,strong decrease in rate of protein secretion,CMPO_0000319,0305-05--2007-04-04,o19
2700,305,356,606071,Homo sapiens,NCBITaxon,NCBITaxon_9606,HeLa,EFO,EFO_0001185,SI00164052,UAAACGCUGAUACUUAGCCtg,GGCUAAGUAUCAGCGUUUAtt,"NCBI35, Ensembl release 27, Dec 2004",ENSG00000173681,CXorf23,,Ensembl release 61 gene symbol,"GRCh37, Ensembl release 61, Feb 2011, Gene Symbols from Ensembl release 61 or 81",,,dapi: DNA;vsvg-cfp: CFP-tsO45G ;pm-647: cell surface tsO45G,,chromosome X open reading frame 23,1.7631,yes,yes,multiple replicates of reagent,strong inhibition of secretion,strong decrease in rate of protein secretion,CMPO_0000319,0305-05--2007-04-04,o20
2700,305,357,606110,Homo sapiens,NCBITaxon,NCBITaxon_9606,HeLa,EFO,EFO_0001185,SI00357784,AUACUCAAUAUAUUCCACCtg,GGUGGAAUAUAUUGAGUAUtt,"NCBI35, Ensembl release 27, Dec 2004",ENSG00000123575,FAM199X,,Ensembl release 61 gene symbol,"GRCh37, Ensembl release 61, Feb 2011, Gene Symbols from Ensembl release 61 or 81",,,dapi: DNA;vsvg-cfp: CFP-tsO45G ;pm-647: cell surface tsO45G,,"family with sequence similarity 199, X-linked",3.5281,yes,yes,multiple replicates of reagent,strong inhibition of secretion,strong decrease in rate of protein secretion,CMPO_0000319,0305-05--2007-04-04,o21
2700,305,358,606038,Homo sapiens,NCBITaxon,NCBITaxon_9606,HeLa,EFO,EFO_0001185,Q103860,CCGUAUCGUAAGCAGUACUtt,AGUACUGCUUACGAUACGGtt,"NCBI35, Ensembl release 27, Dec 2004",,,,no perfect match to a gene transcript in Ensembl 61,"GRCh37, Ensembl release 61, Feb 2011, Gene Symbols from Ensembl release 61 or 81",,,dapi: DNA;vsvg-cfp: CFP-tsO45G ;pm-647: cell surface tsO45G,,,,,,,,,,0305-05--2007-04-04,o22
2700,305,359,605990,Homo sapiens,NCBITaxon,NCBITaxon_9606,HeLa,EFO,EFO_0001185,SI00388234,UGAAGUAUUAUAGACAACCag,GGUUGUCUAUAAUACUUCAtt,"NCBI35, Ensembl release 27, Dec 2004",ENSG00000147231,CXorf57,,Ensembl release 81 gene symbol added by IDR curator,"GRCh37, Ensembl release 61, Feb 2011, Gene Symbols from Ensembl release 61 or 81",,,dapi: DNA;vsvg-cfp: CFP-tsO45G ;pm-647: cell surface tsO45G,,,,,,,,,,0305-05--2007-04-04,o23
2700,305,360,605951,Homo sapiens,NCBITaxon,NCBITaxon_9606,HeLa,EFO,EFO_0001185,SI00358456,UAUAUGGUAGAUGUGUGCGtg,CGCACACAUCUACCAUAUAtt,"NCBI35, Ensembl release 27, Dec 2004",ENSG00000161544,CYGB,,Ensembl release 61 gene symbol,"GRCh37, Ensembl release 61, Feb 2011, Gene Symbols from Ensembl release 61 or 81",,,dapi: DNA;vsvg-cfp: CFP-tsO45G ;pm-647: cell surface tsO45G,,cytoglobin,3.9241,yes,yes,multiple replicates of reagent,strong inhibition of secretion,strong decrease in rate of protein secretion,CMPO_0000319,0305-05--2007-04-04,o24
2700,305,361,605782,Homo sapiens,NCBITaxon,NCBITaxon_9606,HeLa,EFO,EFO_0001185,SI00358568,UUGAAGAAGGUUCAGAAGGtg,CCUUCUGAACCUUCUUCAAtt,"NCBI35, Ensembl release 27, Dec 2004",ENSG00000106665,CLIP2,,Ensembl release 81 gene symbol added by IDR curator,"GRCh37, Ensembl release 61, Feb 2011, Gene Symbols from Ensembl release 61 or 81",,,dapi: DNA;vsvg-cfp: CFP-tsO45G ;pm-647: cell surface tsO45G,,,,,,,,,,0305-05--2007-04-04,p1
2700,305,362,605800,Homo sapiens,NCBITaxon,NCBITaxon_9606,HeLa,EFO,EFO_0001185,Q00000176728,UUAGAGAUGCGAUAAUUCCta,GGAAUUAUCGCAUCUCUAAtt,"NCBI35, Ensembl release 27, Dec 2004",,,,no perfect match to a gene transcript in Ensembl 61,"GRCh37, Ensembl release 61, Feb 2011, Gene Symbols from Ensembl release 61 or 81",,,dapi: DNA;vsvg-cfp: CFP-tsO45G ;pm-647: cell surface tsO45G,,,,,,,,,,0305-05--2007-04-04,p2
2700,305,363,606106,Homo sapiens,NCBITaxon,NCBITaxon_9606,HeLa,EFO,EFO_0001185,SI00015526,UGAAGAUUGCUUUAGUGCCtg,GGCACUAAAGCAAUCUUCAtt,"NCBI35, Ensembl release 27, Dec 2004",ENSG00000095596,CYP26A1,,Ensembl release 81 gene symbol added by IDR curator,"GRCh37, Ensembl release 61, Feb 2011, Gene Symbols from Ensembl release 61 or 81",,,dapi: DNA;vsvg-cfp: CFP-tsO45G ;pm-647: cell surface tsO45G,,,,,,,,,,0305-05--2007-04-04,p3
2700,305,364,606091,Homo sapiens,NCBITaxon,NCBITaxon_9606,HeLa,EFO,EFO_0001185,SI00090573,UUCUCUACGAAUGUCUGCUtt,AGCAGACAUUCGUAGAGAAtt,"NCBI35, Ensembl release 27, Dec 2004",ENSG00000173198,CYSLTR1,,Ensembl release 61 gene symbol,"GRCh37, Ensembl release 61, Feb 2011, Gene Symbols from Ensembl release 61 or 81",,,dapi: DNA;vsvg-cfp: CFP-tsO45G ;pm-647: cell surface tsO45G,,cysteinyl leukotriene receptor 1,2.1344,yes,yes,multiple replicates of reagent,strong inhibition of secretion,strong decrease in rate of protein secretion,CMPO_0000319,0305-05--2007-04-04,p4
2700,305,365,605828,Homo sapiens,NCBITaxon,NCBITaxon_9606,HeLa,EFO,EFO_0001185,SI03290763,UUAGACACCGUGGAGAACGgc,CGUUCUCCACGGUGUCUAAtt,"NCBI35, Ensembl release 27, Dec 2004",ENSG00000180902,D2HGDH,,Ensembl release 61 gene symbol,"GRCh37, Ensembl release 61, Feb 2011, Gene Symbols from Ensembl release 61 or 81",,,dapi: DNA;vsvg-cfp: CFP-tsO45G ;pm-647: cell surface tsO45G,,D-2-hydroxyglutarate dehydrogenase,2.1609,yes,yes,multiple replicates of reagent,strong inhibition of secretion,strong decrease in rate of protein secretion,CMPO_0000319,0305-05--2007-04-04,p5
2700,305,366,605966,Homo sapiens,NCBITaxon,NCBITaxon_9606,HeLa,EFO,EFO_0001185,SI00757113,UUUAUGAUGAGCCAAUUCCca,GGAAUUGGCUCAUCAUAAAtt,"NCBI35, Ensembl release 27, Dec 2004",ENSG00000186458,DEFB132,,Ensembl release 81 gene symbol added by IDR curator,"GRCh37, Ensembl release 61, Feb 2011, Gene Symbols from Ensembl release 61 or 81",,,dapi: DNA;vsvg-cfp: CFP-tsO45G ;pm-647: cell surface tsO45G,,,,,,,,,,0305-05--2007-04-04,p6
2700,305,367,605773,Homo sapiens,NCBITaxon,NCBITaxon_9606,HeLa,EFO,EFO_0001185,Q24546,AUUAGGAUGUUGAAGAUCCtt,GGAUCUUCAACAUCCUAAUtt,"NCBI35, Ensembl release 27, Dec 2004",,,,"siRNA original target COPB1, siRNA matched to multiple genes (ENSG00000129083;ENSG00000129084)","GRCh37, Ensembl release 61, Feb 2011, Gene Symbols from Ensembl release 61 or 81",positive control,,dapi: DNA;vsvg-cfp: CFP-tsO45G ;pm-647: cell surface tsO45G,,,,,,,,,,0305-05--2007-04-04,p7
2700,305,368,605840,Homo sapiens,NCBITaxon,NCBITaxon_9606,HeLa,EFO,EFO_0001185,SI00637700,UUCAGCAUAUAAGCAUUGGga,CCAAUGCUUAUAUGCUGAAtt,"NCBI35, Ensembl release 27, Dec 2004",ENSG00000003249,DBNDD1,,Ensembl release 61 gene symbol,"GRCh37, Ensembl release 61, Feb 2011, Gene Symbols from Ensembl release 61 or 81",,,dapi: DNA;vsvg-cfp: CFP-tsO45G ;pm-647: cell surface tsO45G,,dysbindin (dystrobrevin binding protein 1) domain containing 1,1.229,yes,yes,multiple replicates of reagent,strong inhibition of secretion,strong decrease in rate of protein secretion,CMPO_0000319,0305-05--2007-04-04,p8
2700,305,369,605862,Homo sapiens,NCBITaxon,NCBITaxon_9606,HeLa,EFO,EFO_0001185,SI00359779,AUUAUUAUAAAGUUAAGUCtt,GACUUAACUUUAUAAUAAUtt,"NCBI35, Ensembl release 27, Dec 2004",ENSG00000138231,DBR1,,Ensembl release 61 gene symbol,"GRCh37, Ensembl release 61, Feb 2011, Gene Symbols from Ensembl release 61 or 81",,,dapi: DNA;vsvg-cfp: CFP-tsO45G ;pm-647: cell surface tsO45G,,debranching enzyme homolog 1 (S. cerevisiae),2.7493,yes,yes,multiple replicates of reagent,strong inhibition of secretion,strong decrease in rate of protein secretion,CMPO_0000319,0305-05--2007-04-04,p9
2700,305,370,606025,Homo sapiens,NCBITaxon,NCBITaxon_9606,HeLa,EFO,EFO_0001185,SI00360003,UUGGCUUUGGUGCCUGUCUgg,AGACAGGCACCAAAGCCAAtt,"NCBI35, Ensembl release 27, Dec 2004",ENSG00000161634,DCD,,Ensembl release 81 gene symbol added by IDR curator,"GRCh37, Ensembl release 61, Feb 2011, Gene Symbols from Ensembl release 61 or 81",,,dapi: DNA;vsvg-cfp: CFP-tsO45G ;pm-647: cell surface tsO45G,,,,,,,,,,0305-05--2007-04-04,p10
2700,305,371,606169,Homo sapiens,NCBITaxon,NCBITaxon_9606,HeLa,EFO,EFO_0001185,SI00360325,UUUCUUUGCUUUCUAUUCCtt,GGAAUAGAAAGCAAAGAAAtt,"NCBI35, Ensembl release 27, Dec 2004",ENSG00000080166,DCT,,Ensembl release 81 gene symbol added by IDR curator,"GRCh37, Ensembl release 61, Feb 2011, Gene Symbols from Ensembl release 61 or 81",,,dapi: DNA;vsvg-cfp: CFP-tsO45G ;pm-647: cell surface tsO45G,,,,,,,,,,0305-05--2007-04-04,p11
2700,305,372,605886,Homo sapiens,NCBITaxon,NCBITaxon_9606,HeLa,EFO,EFO_0001185,SI00360374,UUUAUAUUCUUUAGAUGCCta,GGCAUCUAAAGAAUAUAAAtt,"NCBI35, Ensembl release 27, Dec 2004",ENSG00000129187,DCTD,,Ensembl release 61 gene symbol,"GRCh37, Ensembl release 61, Feb 2011, Gene Symbols from Ensembl release 61 or 81",,,dapi: DNA;vsvg-cfp: CFP-tsO45G ;pm-647: cell surface tsO45G,,dCMP deaminase,1.706,yes,yes,multiple replicates of reagent,strong inhibition of secretion,strong decrease in rate of protein secretion,CMPO_0000319,0305-05--2007-04-04,p12
2700,305,373,606072,Homo sapiens,NCBITaxon,NCBITaxon_9606,HeLa,EFO,EFO_0001185,,,,"NCBI35, Ensembl release 27, Dec 2004",,,,,"GRCh37, Ensembl release 61, Feb 2011, Gene Symbols from Ensembl release 61 or 81",,,dapi: DNA;vsvg-cfp: CFP-tsO45G ;pm-647: cell surface tsO45G,annotation not available,,,,,,,,,0305-05--2007-04-04,p13
2700,305,374,606134,Homo sapiens,NCBITaxon,NCBITaxon_9606,HeLa,EFO,EFO_0001185,SI00360626,UAUAUUUCUGAUAUGUUCUtg,AGAACAUAUCAGAAAUAUAtt,"NCBI35, Ensembl release 27, Dec 2004",ENSG00000151693,ASAP2,,Ensembl release 81 gene symbol added by IDR curator,"GRCh37, Ensembl release 61, Feb 2011, Gene Symbols from Ensembl release 61 or 81",,,dapi: DNA;vsvg-cfp: CFP-tsO45G ;pm-647: cell surface tsO45G,,,,,,,,,,0305-05--2007-04-04,p14
2700,305,375,605850,Homo sapiens,NCBITaxon,NCBITaxon_9606,HeLa,EFO,EFO_0001185,SI02634107,UAUAACAUAAGGAACACCGtg,CGGUGUUCCUUAUGUUAUAtt,"NCBI35, Ensembl release 27, Dec 2004",ENSG00000079785,DDX1,,Ensembl release 81 gene symbol added by IDR curator,"GRCh37, Ensembl release 61, Feb 2011, Gene Symbols from Ensembl release 61 or 81",,,dapi: DNA;vsvg-cfp: CFP-tsO45G ;pm-647: cell surface tsO45G,,,,,,,,,,0305-05--2007-04-04,p15
2700,305,376,605787,Homo sapiens,NCBITaxon,NCBITaxon_9606,HeLa,EFO,EFO_0001185,Q103860,CCGUAUCGUAAGCAGUACUtt,AGUACUGCUUACGAUACGGtt,"NCBI35, Ensembl release 27, Dec 2004",,,,no perfect match to a gene transcript in Ensembl 61,"GRCh37, Ensembl release 61, Feb 2011, Gene Symbols from Ensembl release 61 or 81",,,dapi: DNA;vsvg-cfp: CFP-tsO45G ;pm-647: cell surface tsO45G,,,,,,,,,,0305-05--2007-04-04,p16
2700,305,377,606092,Homo sapiens,NCBITaxon,NCBITaxon_9606,HeLa,EFO,EFO_0001185,SI00361067,UGGGCAAUUAAGUUCUGUGgg,CACAGAACUUAAUUGCCCAtt,"NCBI35, Ensembl release 27, Dec 2004",ENSG00000157349,DDX19B,,Ensembl release 61 gene symbol,"GRCh37, Ensembl release 61, Feb 2011, Gene Symbols from Ensembl release 61 or 81",,,dapi: DNA;vsvg-cfp: CFP-tsO45G ;pm-647: cell surface tsO45G,,DEAD (Asp-Glu-Ala-As) box polypeptide 19B,1.7476,yes,yes,multiple replicates of reagent,strong inhibition of secretion,strong decrease in rate of protein secretion,CMPO_0000319,0305-05--2007-04-04,p17
2700,305,378,605985,Homo sapiens,NCBITaxon,NCBITaxon_9606,HeLa,EFO,EFO_0001185,SI00361382,AUUAACUUCAAACCGGUCCtg,GGACCGGUUUGAAGUUAAUtt,"NCBI35, Ensembl release 27, Dec 2004",ENSG00000123136,DDX39,DDX39A,Ensembl release 61 gene symbol,"GRCh37, Ensembl release 61, Feb 2011, Gene Symbols from Ensembl release 61 or 81",,,dapi: DNA;vsvg-cfp: CFP-tsO45G ;pm-647: cell surface tsO45G,,DEAD (Asp-Glu-Ala-Asp) box polypeptide 39,1.3213,yes,yes,multiple replicates of reagent,strong inhibition of secretion,strong decrease in rate of protein secretion,CMPO_0000319,0305-05--2007-04-04,p18
2700,305,379,606011,Homo sapiens,NCBITaxon,NCBITaxon_9606,HeLa,EFO,EFO_0001185,SI00361438,UACUAGUACAAGCAUAUCCtt,GGAUAUGCUUGUACUAGUAtt,"NCBI35, Ensembl release 27, Dec 2004",ENSG00000067048,DDX3Y,,Ensembl release 61 gene symbol,"GRCh37, Ensembl release 61, Feb 2011, Gene Symbols from Ensembl release 61 or 81",,,dapi: DNA;vsvg-cfp: CFP-tsO45G ;pm-647: cell surface tsO45G,,"DEAD (Asp-Glu-Ala-Asp) box polypeptide 3, Y-linked",1.9329,yes,yes,multiple replicates of reagent,strong inhibition of secretion,strong decrease in rate of protein secretion,CMPO_0000319,0305-05--2007-04-04,p19
2700,305,380,606112,Homo sapiens,NCBITaxon,NCBITaxon_9606,HeLa,EFO,EFO_0001185,SI02823618,UUUCAGUCUACAUAUGGUUgt,AACCAUAUGUAGACUGAAAtt,"NCBI35, Ensembl release 27, Dec 2004",ENSG00000180872,DEFB112,,Ensembl release 81 gene symbol added by IDR curator,"GRCh37, Ensembl release 61, Feb 2011, Gene Symbols from Ensembl release 61 or 81",,,dapi: DNA;vsvg-cfp: CFP-tsO45G ;pm-647: cell surface tsO45G,,,,,,,,,,0305-05--2007-04-04,p20
2700,305,381,605981,Homo sapiens,NCBITaxon,NCBITaxon_9606,HeLa,EFO,EFO_0001185,SI00054516,AUACACUGUGAUUAAUAGCtg,GCUAUUAAUCACAGUGUAUtt,"NCBI35, Ensembl release 27, Dec 2004",ENSG00000143753,DEGS1,,Ensembl release 61 gene symbol,"GRCh37, Ensembl release 61, Feb 2011, Gene Symbols from Ensembl release 61 or 81",,,dapi: DNA;vsvg-cfp: CFP-tsO45G ;pm-647: cell surface tsO45G,,"degenerative spermatocyte homolog 1, lipid desaturase (Drosophila)",2.5535,yes,yes,multiple replicates of reagent,strong inhibition of secretion,strong decrease in rate of protein secretion,CMPO_0000319,0305-05--2007-04-04,p21
2700,305,382,605804,Homo sapiens,NCBITaxon,NCBITaxon_9606,HeLa,EFO,EFO_0001185,SI00335538,UUUAUAAUUGAGAUAUUUCat,GAAAUAUCUCAAUUAUAAAtt,"NCBI35, Ensembl release 27, Dec 2004",ENSG00000137145,DENND4C,,Ensembl release 61 gene symbol,"GRCh37, Ensembl release 61, Feb 2011, Gene Symbols from Ensembl release 61 or 81",,,dapi: DNA;vsvg-cfp: CFP-tsO45G ;pm-647: cell surface tsO45G,,DENN/MADD domain containing 4C,3.1172,yes,yes,multiple replicates of reagent,strong inhibition of secretion,strong decrease in rate of protein secretion,CMPO_0000319,0305-05--2007-04-04,p22
2700,305,383,606190,Homo sapiens,NCBITaxon,NCBITaxon_9606,HeLa,EFO,EFO_0001185,Q111531,CAAUAUGUCUCUAUGCCGCtg,GCGGCAUAGAGACAUAUUGtt,"NCBI35, Ensembl release 27, Dec 2004",ENSG00000108587,GOSR1,,Ensembl release 81 gene symbol added by IDR curator,"GRCh37, Ensembl release 61, Feb 2011, Gene Symbols from Ensembl release 61 or 81",positive control,,dapi: DNA;vsvg-cfp: CFP-tsO45G ;pm-647: cell surface tsO45G,,,,,,,,,,0305-05--2007-04-04,p23
2700,305,384,606027,Homo sapiens,NCBITaxon,NCBITaxon_9606,HeLa,EFO,EFO_0001185,,,,"NCBI35, Ensembl release 27, Dec 2004",,,,,"GRCh37, Ensembl release 61, Feb 2011, Gene Symbols from Ensembl release 61 or 81",,,dapi: DNA;vsvg-cfp: CFP-tsO45G ;pm-647: cell surface tsO45G,annotation not available,,,,,,,,,0305-05--2007-04-04,p24
2699,305,1,605607,,,,,,,,,,,,,,,,empty well,,dapi: DNA;vsvg-cfp: CFP-tsO45G ;pm-647: cell surface tsO45G,,,,,,,,,,0305-06--2007-05-30,a1
2699,305,2,605449,Homo sapiens,NCBITaxon,NCBITaxon_9606,HeLa,EFO,EFO_0001185,SI00289037,UAACUCUCUCUAUUAAGGGtt,CCCUUAAUAGAGAGAGUUAtt,"NCBI35, Ensembl release 27, Dec 2004",ENSG00000109576,AADAT,,Ensembl release 61 gene symbol,"GRCh37, Ensembl release 61, Feb 2011, Gene Symbols from Ensembl release 61 or 81",,,dapi: DNA;vsvg-cfp: CFP-tsO45G ;pm-647: cell surface tsO45G,,,,,,,,,,0305-06--2007-05-30,a2
2699,305,3,605513,Homo sapiens,NCBITaxon,NCBITaxon_9606,HeLa,EFO,EFO_0001185,SI02224586,UUCAUCAGGUUUACCACCUgg,AGGUGGUAAACCUGAUGAAtt,"NCBI35, Ensembl release 27, Dec 2004",ENSG00000115977,AAK1,,Ensembl release 81 gene symbol added by IDR curator,"GRCh37, Ensembl release 61, Feb 2011, Gene Symbols from Ensembl release 61 or 81",,,dapi: DNA;vsvg-cfp: CFP-tsO45G ;pm-647: cell surface tsO45G,,,,,,,,,,0305-06--2007-05-30,a3
2699,305,4,605456,Homo sapiens,NCBITaxon,NCBITaxon_9606,HeLa,EFO,EFO_0001185,SI00289219,UUCCGUAUGGAAUCAUCGGga,CCGAUGAUUCCAUACGGAAtt,"NCBI35, Ensembl release 27, Dec 2004",ENSG00000183044,ABAT,,Ensembl release 61 gene symbol,"GRCh37, Ensembl release 61, Feb 2011, Gene Symbols from Ensembl release 61 or 81",,,dapi: DNA;vsvg-cfp: CFP-tsO45G ;pm-647: cell surface tsO45G,,4-aminobutyrate aminotransferase,2.4305,yes,yes,multiple replicates of reagent,strong inhibition of secretion,strong decrease in rate of protein secretion,CMPO_0000319,0305-06--2007-05-30,a4
2699,305,5,605460,Homo sapiens,NCBITaxon,NCBITaxon_9606,HeLa,EFO,EFO_0001185,SI00078085,UACUGUUCGUUGUACAUCCag,GGAUGUACAACGAACAGUAtt,"NCBI35, Ensembl release 27, Dec 2004",ENSG00000165029,ABCA1,,Ensembl release 61 gene symbol,"GRCh37, Ensembl release 61, Feb 2011, Gene Symbols from Ensembl release 61 or 81",,,dapi: DNA;vsvg-cfp: CFP-tsO45G ;pm-647: cell surface tsO45G,,"ATP-binding cassette, sub-family A (ABC1), member 1",1.3921,yes,yes,multiple replicates of reagent,strong inhibition of secretion,strong decrease in rate of protein secretion,CMPO_0000319,0305-06--2007-05-30,a5
2699,305,6,605675,Homo sapiens,NCBITaxon,NCBITaxon_9606,HeLa,EFO,EFO_0001185,SI00289331,UUGAUGAUGAGUUAUAUUCtg,GAAUAUAACUCAUCAUCAAtt,"NCBI35, Ensembl release 27, Dec 2004",ENSG00000179869,ABCA13,,Ensembl release 81 gene symbol added by IDR curator,"GRCh37, Ensembl release 61, Feb 2011, Gene Symbols from Ensembl release 61 or 81",,,dapi: DNA;vsvg-cfp: CFP-tsO45G ;pm-647: cell surface tsO45G,,,,,,,,,,0305-06--2007-05-30,a6
2699,305,7,605610,Homo sapiens,NCBITaxon,NCBITaxon_9606,HeLa,EFO,EFO_0001185,SI00146419,UUUGUUGACGGGUACCAGCag,GCUGGUACCCGUCAACAAAtt,"NCBI35, Ensembl release 27, Dec 2004",ENSG00000124574,ABCC10,,Ensembl release 81 gene symbol added by IDR curator,"GRCh37, Ensembl release 61, Feb 2011, Gene Symbols from Ensembl release 61 or 81",,,dapi: DNA;vsvg-cfp: CFP-tsO45G ;pm-647: cell surface tsO45G,,,,,,,,,,0305-06--2007-05-30,a7
2699,305,8,605544,Homo sapiens,NCBITaxon,NCBITaxon_9606,HeLa,EFO,EFO_0001185,SI00022981,UUAGCAGGUGACCAAUGGGtg,CCCAUUGGUCACCUGCUAAtt,"NCBI35, Ensembl release 27, Dec 2004",ENSG00000091262,ABCC6,,Ensembl release 61 gene symbol,"GRCh37, Ensembl release 61, Feb 2011, Gene Symbols from Ensembl release 61 or 81",,,dapi: DNA;vsvg-cfp: CFP-tsO45G ;pm-647: cell surface tsO45G,,"ATP-binding cassette, sub-family C (CFTR/MRP), member 6",2.488,yes,yes,multiple replicates of reagent,strong inhibition of secretion,strong decrease in rate of protein secretion,CMPO_0000319,0305-06--2007-05-30,a8
2699,305,9,605554,Homo sapiens,NCBITaxon,NCBITaxon_9606,HeLa,EFO,EFO_0001185,SI00289905,UUGUUAAACACGACAGCCUgg,AGGCUGUCGUGUUUAACAAtt,"NCBI35, Ensembl release 27, Dec 2004",ENSG00000143994,ABHD1,,Ensembl release 61 gene symbol,"GRCh37, Ensembl release 61, Feb 2011, Gene Symbols from Ensembl release 61 or 81",,,dapi: DNA;vsvg-cfp: CFP-tsO45G ;pm-647: cell surface tsO45G,,abhydrolase domain containing 1,2.4407,yes,yes,multiple replicates of reagent,strong inhibition of secretion,strong decrease in rate of protein secretion,CMPO_0000319,0305-06--2007-05-30,a9
2699,305,10,605506,Homo sapiens,NCBITaxon,NCBITaxon_9606,HeLa,EFO,EFO_0001185,SI00317975,UAAUGUACCAAUUUAUUGCat,GCAAUAAAUUGGUACAUUAtt,"NCBI35, Ensembl release 27, Dec 2004",ENSG00000139826,ABHD13,,Ensembl release 61 gene symbol,"GRCh37, Ensembl release 61, Feb 2011, Gene Symbols from Ensembl release 61 or 81",,,dapi: DNA;vsvg-cfp: CFP-tsO45G ;pm-647: cell surface tsO45G,,abhydrolase domain containing 13,2.8163,yes,yes,multiple replicates of reagent,strong inhibition of secretion,strong decrease in rate of protein secretion,CMPO_0000319,0305-06--2007-05-30,a10
2699,305,11,605566,Homo sapiens,NCBITaxon,NCBITaxon_9606,HeLa,EFO,EFO_0001185,SI00290010,UUAAGGUGUGAUAUAGACGta,CGUCUAUAUCACACCUUAAtt,"NCBI35, Ensembl release 27, Dec 2004",ENSG00000011198,ABHD5,,Ensembl release 61 gene symbol,"GRCh37, Ensembl release 61, Feb 2011, Gene Symbols from Ensembl release 61 or 81",,,dapi: DNA;vsvg-cfp: CFP-tsO45G ;pm-647: cell surface tsO45G,,abhydrolase domain containing 5,2.9809,yes,yes,multiple replicates of reagent,strong inhibition of secretion,strong decrease in rate of protein secretion,CMPO_0000319,0305-06--2007-05-30,a11
2699,305,12,605614,Homo sapiens,NCBITaxon,NCBITaxon_9606,HeLa,EFO,EFO_0001185,,,,"NCBI35, Ensembl release 27, Dec 2004",,,,,"GRCh37, Ensembl release 61, Feb 2011, Gene Symbols from Ensembl release 61 or 81",,,dapi: DNA;vsvg-cfp: CFP-tsO45G ;pm-647: cell surface tsO45G,annotation not available,,,,,,,,,0305-06--2007-05-30,a12