Plate,Plate Group,Well Number,Well,Characteristics [Organism],Term Source 1 REF,Term Source 1 Accession,Characteristics [Cell Line],Term Source 2 REF,Term Source 2 Accession,siRNA Identifier,Antisense Sequence,Sense Sequence,Reagent Design Gene Annotation Build,Gene Identifier,Gene Symbol,Gene Symbol Synonyms,Gene Annotation Comments,Analysis Gene Annotation Build,Control Type,Control Comments,Channels,Comments,Gene Description,Deviation,Overall Strong Inhibitor Gene Hit,Has Phenotype,Phenotype Annotation Level,Phenotype 1,Phenotype 1 Term Name,Phenotype 1 Term Accession,Plate Name,Well Name
2701,305,233,606526,Homo sapiens,NCBITaxon,NCBITaxon_9606,HeLa,EFO,EFO_0001185,SI03019926,UAUAUGAUGAUAGAAUAGGgt,CCUAUUCUAUCAUCAUAUAtt,"NCBI35, Ensembl release 27, Dec 2004",ENSG00000186638,KIF24,,Ensembl release 81 gene symbol added by IDR curator,"GRCh37, Ensembl release 61, Feb 2011, Gene Symbols from Ensembl release 61 or 81",,,dapi: DNA;vsvg-cfp: CFP-tsO45G ;pm-647: cell surface tsO45G,,,,,,,,,,0305-04--2007-04-14,j17
2701,305,234,606513,Homo sapiens,NCBITaxon,NCBITaxon_9606,HeLa,EFO,EFO_0001185,SI00335580,UAGCAGGUCAAUAAAUAUCtg,GAUAUUUAUUGACCUGCUAtt,"NCBI35, Ensembl release 27, Dec 2004",ENSG00000126878,AIF1L,,Ensembl release 81 gene symbol added by IDR curator,"GRCh37, Ensembl release 61, Feb 2011, Gene Symbols from Ensembl release 61 or 81",,,dapi: DNA;vsvg-cfp: CFP-tsO45G ;pm-647: cell surface tsO45G,,,,,,,,,,0305-04--2007-04-14,j18
2701,305,235,606413,Homo sapiens,NCBITaxon,NCBITaxon_9606,HeLa,EFO,EFO_0001185,SI00336105,UUUGAUAUUACAAAGUCACtt,GUGACUUUGUAAUAUCAAAtt,"NCBI35, Ensembl release 27, Dec 2004",ENSG00000148153,INIP,,Ensembl release 81 gene symbol added by IDR curator,"GRCh37, Ensembl release 61, Feb 2011, Gene Symbols from Ensembl release 61 or 81",,,dapi: DNA;vsvg-cfp: CFP-tsO45G ;pm-647: cell surface tsO45G,,,,,,,,,,0305-04--2007-04-14,j19
2701,305,236,606468,Homo sapiens,NCBITaxon,NCBITaxon_9606,HeLa,EFO,EFO_0001185,SI00336560,UUUCUGGAUGCAGUCCUGCtg,GCAGGACUGCAUCCAGAAAtt,"NCBI35, Ensembl release 27, Dec 2004",ENSG00000165695,AK8,,Ensembl release 81 gene symbol added by IDR curator,"GRCh37, Ensembl release 61, Feb 2011, Gene Symbols from Ensembl release 61 or 81",,,dapi: DNA;vsvg-cfp: CFP-tsO45G ;pm-647: cell surface tsO45G,,,,,,,,,,0305-04--2007-04-14,j20
2701,305,237,606586,Homo sapiens,NCBITaxon,NCBITaxon_9606,HeLa,EFO,EFO_0001185,SI00336882,UUCAGUGGCAUGAAGUCCGcg,CGGACUUCAUGCCACUGAAtt,"NCBI35, Ensembl release 27, Dec 2004",ENSG00000163050,ADCK3,,Ensembl release 81 gene symbol added by IDR curator,"GRCh37, Ensembl release 61, Feb 2011, Gene Symbols from Ensembl release 61 or 81",,,dapi: DNA;vsvg-cfp: CFP-tsO45G ;pm-647: cell surface tsO45G,,,,,,,,,,0305-04--2007-04-14,j21
2701,305,238,606492,Homo sapiens,NCBITaxon,NCBITaxon_9606,HeLa,EFO,EFO_0001185,Q111531,CAAUAUGUCUCUAUGCCGCtg,GCGGCAUAGAGACAUAUUGtt,"NCBI35, Ensembl release 27, Dec 2004",ENSG00000108587,GOSR1,,Ensembl release 81 gene symbol added by IDR curator,"GRCh37, Ensembl release 61, Feb 2011, Gene Symbols from Ensembl release 61 or 81",positive control,,dapi: DNA;vsvg-cfp: CFP-tsO45G ;pm-647: cell surface tsO45G,,,,,,,,,,0305-04--2007-04-14,j22
2701,305,239,606556,Homo sapiens,NCBITaxon,NCBITaxon_9606,HeLa,EFO,EFO_0001185,SI00001225,UUAAGAGGUCGUAGCACCCgg,GGGUGCUACGACCUCUUAAtt,"NCBI35, Ensembl release 27, Dec 2004",ENSG00000141837,CACNA1A,,Ensembl release 61 gene symbol,"GRCh37, Ensembl release 61, Feb 2011, Gene Symbols from Ensembl release 61 or 81",,,dapi: DNA;vsvg-cfp: CFP-tsO45G ;pm-647: cell surface tsO45G,,"calcium channel, voltage-dependent, P/Q type, alpha 1A subunit",2.6863,yes,yes,multiple replicates of reagent,strong inhibition of secretion,strong decrease in rate of protein secretion,CMPO_0000319,0305-04--2007-04-14,j23
2701,305,240,606334,Homo sapiens,NCBITaxon,NCBITaxon_9606,HeLa,EFO,EFO_0001185,SI00121562,UUAGGUAGAGCUUAAUCGCtt,GCGAUUAAGCUCUACCUAAtt,"NCBI35, Ensembl release 27, Dec 2004",ENSG00000157445,CACNA2D3,,Ensembl release 81 gene symbol added by IDR curator,"GRCh37, Ensembl release 61, Feb 2011, Gene Symbols from Ensembl release 61 or 81",,,dapi: DNA;vsvg-cfp: CFP-tsO45G ;pm-647: cell surface tsO45G,,,,,,,,,,0305-04--2007-04-14,j24
2701,305,241,606439,Homo sapiens,NCBITaxon,NCBITaxon_9606,HeLa,EFO,EFO_0001185,SI03078838,UUGGUGUUUGCUAGAACCGgg,CGGUUCUAGCAAACACCAAtt,"NCBI35, Ensembl release 27, Dec 2004",ENSG00000160014,CALM3,,Ensembl release 61 gene symbol,"GRCh37, Ensembl release 61, Feb 2011, Gene Symbols from Ensembl release 61 or 81",,,dapi: DNA;vsvg-cfp: CFP-tsO45G ;pm-647: cell surface tsO45G,,"calmodulin 3 (phosphorylase kinase, delta)",1.2872,yes,yes,multiple replicates of reagent,strong inhibition of secretion,strong decrease in rate of protein secretion,CMPO_0000319,0305-04--2007-04-14,k1
2701,305,242,606517,Homo sapiens,NCBITaxon,NCBITaxon_9606,HeLa,EFO,EFO_0001185,SI00092911,UUUACAUUCGUUGUUCAGGaa,CCUGAACAACGAAUGUAAAtt,"NCBI35, Ensembl release 27, Dec 2004",ENSG00000198668,CALM3,CALM1,Ensembl release 61 gene symbol,"GRCh37, Ensembl release 61, Feb 2011, Gene Symbols from Ensembl release 61 or 81",,,dapi: DNA;vsvg-cfp: CFP-tsO45G ;pm-647: cell surface tsO45G,,"calmodulin 1 (phosphorylase kinase, delta)",1.6262,yes,yes,multiple replicates of reagent,strong inhibition of secretion,strong decrease in rate of protein secretion,CMPO_0000319,0305-04--2007-04-14,k2
2701,305,243,606273,Homo sapiens,NCBITaxon,NCBITaxon_9606,HeLa,EFO,EFO_0001185,SI02758413,UAACACAUUCUGUACAAGGtc,CCUUGUACAGAAUGUGUUAtt,"NCBI35, Ensembl release 27, Dec 2004",ENSG00000143933,CALM2,,Ensembl release 81 gene symbol added by IDR curator,"GRCh37, Ensembl release 61, Feb 2011, Gene Symbols from Ensembl release 61 or 81",,,dapi: DNA;vsvg-cfp: CFP-tsO45G ;pm-647: cell surface tsO45G,,,,,,,,,,0305-04--2007-04-14,k3
2701,305,244,606519,Homo sapiens,NCBITaxon,NCBITaxon_9606,HeLa,EFO,EFO_0001185,SI03035235,UUAGACACCAGGAGGUGCCtt,GGCACCUCCUGGUGUCUAAtt,"NCBI35, Ensembl release 27, Dec 2004",ENSG00000162545,CAMK2N1,,Ensembl release 81 gene symbol added by IDR curator,"GRCh37, Ensembl release 61, Feb 2011, Gene Symbols from Ensembl release 61 or 81",,,dapi: DNA;vsvg-cfp: CFP-tsO45G ;pm-647: cell surface tsO45G,,,,,,,,,,0305-04--2007-04-14,k4
2701,305,245,606231,Homo sapiens,NCBITaxon,NCBITaxon_9606,HeLa,EFO,EFO_0001185,SI00337841,UAGAUUCUUCACUAUACUCtg,GAGUAUAGUGAAGAAUCUAtt,"NCBI35, Ensembl release 27, Dec 2004",ENSG00000108509,CAMTA2,,Ensembl release 81 gene symbol added by IDR curator,"GRCh37, Ensembl release 61, Feb 2011, Gene Symbols from Ensembl release 61 or 81",,,dapi: DNA;vsvg-cfp: CFP-tsO45G ;pm-647: cell surface tsO45G,,,,,,,,,,0305-04--2007-04-14,k5
2701,305,246,606260,Homo sapiens,NCBITaxon,NCBITaxon_9606,HeLa,EFO,EFO_0001185,SI00338639,UUUCACUUCAAUAUCACCUtg,AGGUGAUAUUGAAGUGAAAtt,"NCBI35, Ensembl release 27, Dec 2004",ENSG00000118307,CASC1,,Ensembl release 81 gene symbol added by IDR curator,"GRCh37, Ensembl release 61, Feb 2011, Gene Symbols from Ensembl release 61 or 81",,,dapi: DNA;vsvg-cfp: CFP-tsO45G ;pm-647: cell surface tsO45G,,,,,,,,,,0305-04--2007-04-14,k6
2701,305,247,606297,Homo sapiens,NCBITaxon,NCBITaxon_9606,HeLa,EFO,EFO_0001185,SI00397460,UUUAUUGAGAACAGGAAGCcg,GCUUCCUGUUCUCAAUAAAtt,"NCBI35, Ensembl release 27, Dec 2004",ENSG00000130940,CASZ1,,Ensembl release 81 gene symbol added by IDR curator,"GRCh37, Ensembl release 61, Feb 2011, Gene Symbols from Ensembl release 61 or 81",,,dapi: DNA;vsvg-cfp: CFP-tsO45G ;pm-647: cell surface tsO45G,,,,,,,,,,0305-04--2007-04-14,k7
2701,305,248,606577,Homo sapiens,NCBITaxon,NCBITaxon_9606,HeLa,EFO,EFO_0001185,SI00156772,AUCGAGUGCAACUUAACCGga,CGGUUAAGUUGCACUCGAUtt,"NCBI35, Ensembl release 27, Dec 2004",ENSG00000114423,CBLB,,Ensembl release 81 gene symbol added by IDR curator,"GRCh37, Ensembl release 61, Feb 2011, Gene Symbols from Ensembl release 61 or 81",,,dapi: DNA;vsvg-cfp: CFP-tsO45G ;pm-647: cell surface tsO45G,,,,,,,,,,0305-04--2007-04-14,k8
2701,305,249,606239,Homo sapiens,NCBITaxon,NCBITaxon_9606,HeLa,EFO,EFO_0001185,SI00339073,UUUAACAUCAAGUUAACCUgg,AGGUUAACUUGAUGUUAAAtt,"NCBI35, Ensembl release 27, Dec 2004",ENSG00000054803,CBLN4,,Ensembl release 81 gene symbol added by IDR curator,"GRCh37, Ensembl release 61, Feb 2011, Gene Symbols from Ensembl release 61 or 81",,,dapi: DNA;vsvg-cfp: CFP-tsO45G ;pm-647: cell surface tsO45G,,,,,,,,,,0305-04--2007-04-14,k9
2701,305,250,606405,Homo sapiens,NCBITaxon,NCBITaxon_9606,HeLa,EFO,EFO_0001185,SI00339199,UUGAUGAUGGAUUCGGCCGcg,CGGCCGAAUCCAUCAUCAAtt,"NCBI35, Ensembl release 27, Dec 2004",ENSG00000183741,CBX6,,Ensembl release 81 gene symbol added by IDR curator,"GRCh37, Ensembl release 61, Feb 2011, Gene Symbols from Ensembl release 61 or 81",,,dapi: DNA;vsvg-cfp: CFP-tsO45G ;pm-647: cell surface tsO45G,,,,,,,,,,0305-04--2007-04-14,k10
2701,305,251,606430,Homo sapiens,NCBITaxon,NCBITaxon_9606,HeLa,EFO,EFO_0001185,SI00339339,UACAUGGUGGAAGUCUACCgt,GGUAGACUUCCACCAUGUAtt,"NCBI35, Ensembl release 27, Dec 2004",ENSG00000171097,CCBL1,,Ensembl release 81 gene symbol added by IDR curator,"GRCh37, Ensembl release 61, Feb 2011, Gene Symbols from Ensembl release 61 or 81",,,dapi: DNA;vsvg-cfp: CFP-tsO45G ;pm-647: cell surface tsO45G,,,,,,,,,,0305-04--2007-04-14,k11
2701,305,252,606493,Homo sapiens,NCBITaxon,NCBITaxon_9606,HeLa,EFO,EFO_0001185,SI00637889,UUCCGUGGCUCCAGAGCCGgg,CGGCUCUGGAGCCACGGAAtt,"NCBI35, Ensembl release 27, Dec 2004",ENSG00000159884,CCDC107,,Ensembl release 81 gene symbol added by IDR curator,"GRCh37, Ensembl release 61, Feb 2011, Gene Symbols from Ensembl release 61 or 81",,,dapi: DNA;vsvg-cfp: CFP-tsO45G ;pm-647: cell surface tsO45G,,,,,,,,,,0305-04--2007-04-14,k12
2701,305,253,606482,Homo sapiens,NCBITaxon,NCBITaxon_9606,HeLa,EFO,EFO_0001185,SI00640794,UUUAUGUAAAUCUCUUUCUtg,AGAAAGAGAUUUACAUAAAtt,"NCBI35, Ensembl release 27, Dec 2004",ENSG00000164221,CCDC112,,Ensembl release 81 gene symbol added by IDR curator,"GRCh37, Ensembl release 61, Feb 2011, Gene Symbols from Ensembl release 61 or 81",,,dapi: DNA;vsvg-cfp: CFP-tsO45G ;pm-647: cell surface tsO45G,,,,,,,,,,0305-04--2007-04-14,k13
2701,305,254,606551,Homo sapiens,NCBITaxon,NCBITaxon_9606,HeLa,EFO,EFO_0001185,SI00471779,UUCUUGGGCAUCCCUCAGCag,GCUGAGGGAUGCCCAAGAAtt,"NCBI35, Ensembl release 27, Dec 2004",ENSG00000007080,CCDC124,,Ensembl release 61 gene symbol,"GRCh37, Ensembl release 61, Feb 2011, Gene Symbols from Ensembl release 61 or 81",,,dapi: DNA;vsvg-cfp: CFP-tsO45G ;pm-647: cell surface tsO45G,,coiled-coil domain containing 124,2.211,yes,yes,multiple replicates of reagent,strong inhibition of secretion,strong decrease in rate of protein secretion,CMPO_0000319,0305-04--2007-04-14,k14
2701,305,255,606278,Homo sapiens,NCBITaxon,NCBITaxon_9606,HeLa,EFO,EFO_0001185,Q111531,CAAUAUGUCUCUAUGCCGCtg,GCGGCAUAGAGACAUAUUGtt,"NCBI35, Ensembl release 27, Dec 2004",ENSG00000108587,GOSR1,,Ensembl release 81 gene symbol added by IDR curator,"GRCh37, Ensembl release 61, Feb 2011, Gene Symbols from Ensembl release 61 or 81",positive control,,dapi: DNA;vsvg-cfp: CFP-tsO45G ;pm-647: cell surface tsO45G,,,,,,,,,,0305-04--2007-04-14,k15
2701,305,256,606528,Homo sapiens,NCBITaxon,NCBITaxon_9606,HeLa,EFO,EFO_0001185,SI00621383,UUAUAUACUUAAAUAAAUGtg,CAUUUAUUUAAGUAUAUAAtt,"NCBI35, Ensembl release 27, Dec 2004",ENSG00000169193,CCDC126,,Ensembl release 81 gene symbol added by IDR curator,"GRCh37, Ensembl release 61, Feb 2011, Gene Symbols from Ensembl release 61 or 81",,,dapi: DNA;vsvg-cfp: CFP-tsO45G ;pm-647: cell surface tsO45G,,,,,,,,,,0305-04--2007-04-14,k16
2701,305,257,606258,Homo sapiens,NCBITaxon,NCBITaxon_9606,HeLa,EFO,EFO_0001185,SI00634872,UACAAUAUUUACAACUUACag,GUAAGUUGUAAAUAUUGUAtt,"NCBI35, Ensembl release 27, Dec 2004",ENSG00000198783,ZNF830,,Ensembl release 61 gene symbol,"GRCh37, Ensembl release 61, Feb 2011, Gene Symbols from Ensembl release 61 or 81",,,dapi: DNA;vsvg-cfp: CFP-tsO45G ;pm-647: cell surface tsO45G,,,,,,,,,,0305-04--2007-04-14,k17
2701,305,258,606328,Homo sapiens,NCBITaxon,NCBITaxon_9606,HeLa,EFO,EFO_0001185,SI00405566,UUCUCUUAAAUACACAACCag,GGUUGUGUAUUUAAGAGAAtt,"NCBI35, Ensembl release 27, Dec 2004",ENSG00000180329,CCDC43,,Ensembl release 81 gene symbol added by IDR curator,"GRCh37, Ensembl release 61, Feb 2011, Gene Symbols from Ensembl release 61 or 81",,,dapi: DNA;vsvg-cfp: CFP-tsO45G ;pm-647: cell surface tsO45G,,,,,,,,,,0305-04--2007-04-14,k18
2701,305,259,606310,Homo sapiens,NCBITaxon,NCBITaxon_9606,HeLa,EFO,EFO_0001185,SI03225264,UUGUUUCAUAUUCUUGUCGta,CGACAAGAAUAUGAAACAAtt,"NCBI35, Ensembl release 27, Dec 2004",ENSG00000154240,CEP112,,Ensembl release 81 gene symbol added by IDR curator,"GRCh37, Ensembl release 61, Feb 2011, Gene Symbols from Ensembl release 61 or 81",,,dapi: DNA;vsvg-cfp: CFP-tsO45G ;pm-647: cell surface tsO45G,,,,,,,,,,0305-04--2007-04-14,k19
2701,305,260,606584,Homo sapiens,NCBITaxon,NCBITaxon_9606,HeLa,EFO,EFO_0001185,SI00391979,UGAACUUCCAAGUCCUCCCga,GGGAGGACUUGGAAGUUCAtt,"NCBI35, Ensembl release 27, Dec 2004",ENSG00000164051,CCDC51,,Ensembl release 81 gene symbol added by IDR curator,"GRCh37, Ensembl release 61, Feb 2011, Gene Symbols from Ensembl release 61 or 81",,,dapi: DNA;vsvg-cfp: CFP-tsO45G ;pm-647: cell surface tsO45G,,,,,,,,,,0305-04--2007-04-14,k20
2701,305,261,606524,Homo sapiens,NCBITaxon,NCBITaxon_9606,HeLa,EFO,EFO_0001185,SI00713419,UUUAAUUUAAAGCAGAAUCtg,GAUUCUGCUUUAAAUUAAAtt,"NCBI35, Ensembl release 27, Dec 2004",ENSG00000166510,CCDC68,,Ensembl release 81 gene symbol added by IDR curator,"GRCh37, Ensembl release 61, Feb 2011, Gene Symbols from Ensembl release 61 or 81",,,dapi: DNA;vsvg-cfp: CFP-tsO45G ;pm-647: cell surface tsO45G,,,,,,,,,,0305-04--2007-04-14,k21
2701,305,262,606370,Homo sapiens,NCBITaxon,NCBITaxon_9606,HeLa,EFO,EFO_0001185,Q103860,CCGUAUCGUAAGCAGUACUtt,AGUACUGCUUACGAUACGGtt,"NCBI35, Ensembl release 27, Dec 2004",,,,no perfect match to a gene transcript in Ensembl 61,"GRCh37, Ensembl release 61, Feb 2011, Gene Symbols from Ensembl release 61 or 81",,,dapi: DNA;vsvg-cfp: CFP-tsO45G ;pm-647: cell surface tsO45G,,,,,,,,,,0305-04--2007-04-14,k22
2701,305,263,606491,Homo sapiens,NCBITaxon,NCBITaxon_9606,HeLa,EFO,EFO_0001185,SI00390439,UAUAAAGUGAAGAACUGCUtg,AGCAGUUCUUCACUUUAUAtt,"NCBI35, Ensembl release 27, Dec 2004",ENSG00000125633,CCDC93,,Ensembl release 81 gene symbol added by IDR curator,"GRCh37, Ensembl release 61, Feb 2011, Gene Symbols from Ensembl release 61 or 81",,,dapi: DNA;vsvg-cfp: CFP-tsO45G ;pm-647: cell surface tsO45G,,,,,,,,,,0305-04--2007-04-14,k23
2701,305,264,606535,Homo sapiens,NCBITaxon,NCBITaxon_9606,HeLa,EFO,EFO_0001185,SI00056938,UUGUGAGUAAAGAUCCAGGat,CCUGGAUCUUUACUCACAAtt,"NCBI35, Ensembl release 27, Dec 2004",ENSG00000090061,CCNK,,Ensembl release 81 gene symbol added by IDR curator,"GRCh37, Ensembl release 61, Feb 2011, Gene Symbols from Ensembl release 61 or 81",,,dapi: DNA;vsvg-cfp: CFP-tsO45G ;pm-647: cell surface tsO45G,,,,,,,,,,0305-04--2007-04-14,k24
2701,305,265,606286,Homo sapiens,NCBITaxon,NCBITaxon_9606,HeLa,EFO,EFO_0001185,SI03062584,UUGCGCUCAGUAUAACAAGtg,CUUGUUAUACUGAGCGCAAtt,"NCBI35, Ensembl release 27, Dec 2004",ENSG00000183813,CCR4,,Ensembl release 61 gene symbol,"GRCh37, Ensembl release 61, Feb 2011, Gene Symbols from Ensembl release 61 or 81",,,dapi: DNA;vsvg-cfp: CFP-tsO45G ;pm-647: cell surface tsO45G,,chemokine (C-C motif) receptor 4,1.9834,yes,yes,multiple replicates of reagent,strong inhibition of secretion,strong decrease in rate of protein secretion,CMPO_0000319,0305-04--2007-04-14,l1
2701,305,266,606467,Homo sapiens,NCBITaxon,NCBITaxon_9606,HeLa,EFO,EFO_0001185,SI00012173,UUUACAACCUAUAUGUUGCct,GCAACAUAUAGGUUGUAAAtt,"NCBI35, Ensembl release 27, Dec 2004",ENSG00000160791,CCR5,,Ensembl release 81 gene symbol added by IDR curator,"GRCh37, Ensembl release 61, Feb 2011, Gene Symbols from Ensembl release 61 or 81",,,dapi: DNA;vsvg-cfp: CFP-tsO45G ;pm-647: cell surface tsO45G,,,,,,,,,,0305-04--2007-04-14,l2
2701,305,267,606400,Homo sapiens,NCBITaxon,NCBITaxon_9606,HeLa,EFO,EFO_0001185,SI02662520,UUCCAUAUCAUCUUCAUCUgg,AGAUGAAGAUGAUAUGGAAtt,"NCBI35, Ensembl release 27, Dec 2004",ENSG00000213066,FGFR1OP,,Ensembl release 81 gene symbol added by IDR curator,"GRCh37, Ensembl release 61, Feb 2011, Gene Symbols from Ensembl release 61 or 81",,,dapi: DNA;vsvg-cfp: CFP-tsO45G ;pm-647: cell surface tsO45G,,,,,,,,,,0305-04--2007-04-14,l3
2701,305,268,606350,Homo sapiens,NCBITaxon,NCBITaxon_9606,HeLa,EFO,EFO_0001185,SI03026212,UCAAUAUCUAAUCCAACGUtt,ACGUUGGAUUAGAUAUUGAtt,"NCBI35, Ensembl release 27, Dec 2004",ENSG00000156261,CCT8,,Ensembl release 61 gene symbol,"GRCh37, Ensembl release 61, Feb 2011, Gene Symbols from Ensembl release 61 or 81",,,dapi: DNA;vsvg-cfp: CFP-tsO45G ;pm-647: cell surface tsO45G,,"chaperonin containing TCP1, subunit 8 (theta)",1.7274,yes,yes,multiple replicates of reagent,strong inhibition of secretion,strong decrease in rate of protein secretion,CMPO_0000319,0305-04--2007-04-14,l4
2701,305,269,606477,Homo sapiens,NCBITaxon,NCBITaxon_9606,HeLa,EFO,EFO_0001185,SI03029348,UGAGAGGCAGAACUUCUCGtt,CGAGAAGUUCUGCCUCUCAtt,"NCBI35, Ensembl release 27, Dec 2004",ENSG00000161649,CD300LG,,Ensembl release 81 gene symbol added by IDR curator,"GRCh37, Ensembl release 61, Feb 2011, Gene Symbols from Ensembl release 61 or 81",,,dapi: DNA;vsvg-cfp: CFP-tsO45G ;pm-647: cell surface tsO45G,,,,,,,,,,0305-04--2007-04-14,l5
2701,305,270,606474,Homo sapiens,NCBITaxon,NCBITaxon_9606,HeLa,EFO,EFO_0001185,SI00024234,UUUGAUAAAGACCAGCACCaa,GGUGCUGGUCUUUAUCAAAtt,"NCBI35, Ensembl release 27, Dec 2004",ENSG00000101017,CD40,,Ensembl release 81 gene symbol added by IDR curator,"GRCh37, Ensembl release 61, Feb 2011, Gene Symbols from Ensembl release 61 or 81",,,dapi: DNA;vsvg-cfp: CFP-tsO45G ;pm-647: cell surface tsO45G,,,,,,,,,,0305-04--2007-04-14,l6
2701,305,271,606548,Homo sapiens,NCBITaxon,NCBITaxon_9606,HeLa,EFO,EFO_0001185,Q120368,AAGCUUGAUUGUUUUCCCGtc,CGGGAAAACAAUCAAGCUUtt,"NCBI35, Ensembl release 27, Dec 2004",ENSG00000138069,RAB1A,,Ensembl release 81 gene symbol added by IDR curator,"GRCh37, Ensembl release 61, Feb 2011, Gene Symbols from Ensembl release 61 or 81",,,dapi: DNA;vsvg-cfp: CFP-tsO45G ;pm-647: cell surface tsO45G,,,,,,,,,,0305-04--2007-04-14,l7
2701,305,272,606512,Homo sapiens,NCBITaxon,NCBITaxon_9606,HeLa,EFO,EFO_0001185,SI00001386,UAUAAAUGGAGCUUGACUCga,GAGUCAAGCUCCAUUUAUAtt,"NCBI35, Ensembl release 27, Dec 2004",ENSG00000102245,CD40LG,,Ensembl release 81 gene symbol added by IDR curator,"GRCh37, Ensembl release 61, Feb 2011, Gene Symbols from Ensembl release 61 or 81",,,dapi: DNA;vsvg-cfp: CFP-tsO45G ;pm-647: cell surface tsO45G,,,,,,,,,,0305-04--2007-04-14,l8
2701,305,273,606489,Homo sapiens,NCBITaxon,NCBITaxon_9606,HeLa,EFO,EFO_0001185,SI00340998,UUGCAUGACGAUUGUCUGGtg,CCAGACAAUCGUCAUGCAAtt,"NCBI35, Ensembl release 27, Dec 2004",ENSG00000105401,CDC37,,Ensembl release 81 gene symbol added by IDR curator,"GRCh37, Ensembl release 61, Feb 2011, Gene Symbols from Ensembl release 61 or 81",,,dapi: DNA;vsvg-cfp: CFP-tsO45G ;pm-647: cell surface tsO45G,,,,,,,,,,0305-04--2007-04-14,l9
2701,305,274,606404,Homo sapiens,NCBITaxon,NCBITaxon_9606,HeLa,EFO,EFO_0001185,SI00083909,AUACGGGCUACUAAUCACGgg,CGUGAUUAGUAGCCCGUAUtt,"NCBI35, Ensembl release 27, Dec 2004",ENSG00000198752,CDC42BPB,,Ensembl release 61 gene symbol,"GRCh37, Ensembl release 61, Feb 2011, Gene Symbols from Ensembl release 61 or 81",,,dapi: DNA;vsvg-cfp: CFP-tsO45G ;pm-647: cell surface tsO45G,,CDC42 binding protein kinase beta (DMPK-like),2.6618,yes,yes,multiple replicates of reagent,strong inhibition of secretion,strong decrease in rate of protein secretion,CMPO_0000319,0305-04--2007-04-14,l10
2701,305,275,606289,Homo sapiens,NCBITaxon,NCBITaxon_9606,HeLa,EFO,EFO_0001185,SI00341082,UAAAUGGCACUCUCCUAAGgt,CUUAGGAGAGUGCCAUUUAtt,"NCBI35, Ensembl release 27, Dec 2004",ENSG00000128283,CDC42EP1,,Ensembl release 81 gene symbol added by IDR curator,"GRCh37, Ensembl release 61, Feb 2011, Gene Symbols from Ensembl release 61 or 81",,,dapi: DNA;vsvg-cfp: CFP-tsO45G ;pm-647: cell surface tsO45G,,,,,,,,,,0305-04--2007-04-14,l11
2701,305,276,606214,Homo sapiens,NCBITaxon,NCBITaxon_9606,HeLa,EFO,EFO_0001185,SI03179015,UUCCUCAAUGACAAAGAACtg,GUUCUUUGUCAUUGAGGAAtt,"NCBI35, Ensembl release 27, Dec 2004",ENSG00000139880,CDH24,,Ensembl release 81 gene symbol added by IDR curator,"GRCh37, Ensembl release 61, Feb 2011, Gene Symbols from Ensembl release 61 or 81",,,dapi: DNA;vsvg-cfp: CFP-tsO45G ;pm-647: cell surface tsO45G,,,,,,,,,,0305-04--2007-04-14,l12
2701,305,277,606510,Homo sapiens,NCBITaxon,NCBITaxon_9606,HeLa,EFO,EFO_0001185,SI03166464,AUUGGCAACAUGGAGUUUCtg,GAAACUCCAUGUUGCCAAUtt,"NCBI35, Ensembl release 27, Dec 2004",,,,no perfect match to a gene transcript in Ensembl 61,"GRCh37, Ensembl release 61, Feb 2011, Gene Symbols from Ensembl release 61 or 81",,,dapi: DNA;vsvg-cfp: CFP-tsO45G ;pm-647: cell surface tsO45G,,,,,,,,,,0305-04--2007-04-14,l13
2701,305,278,606423,Homo sapiens,NCBITaxon,NCBITaxon_9606,HeLa,EFO,EFO_0001185,SI03098158,UUCGCAGCCAGGUUCCGCCag,GGCGGAACCUGGCUGCGAAtt,"NCBI35, Ensembl release 27, Dec 2004",ENSG00000176749,CDK5R1,,Ensembl release 81 gene symbol added by IDR curator,"GRCh37, Ensembl release 61, Feb 2011, Gene Symbols from Ensembl release 61 or 81",,,dapi: DNA;vsvg-cfp: CFP-tsO45G ;pm-647: cell surface tsO45G,,,,,,,,,,0305-04--2007-04-14,l14
2701,305,279,606220,Homo sapiens,NCBITaxon,NCBITaxon_9606,HeLa,EFO,EFO_0001185,SI03030713,UUUGCAACAAACUAGUAAGtt,CUUACUAGUUUGUUGCAAAtt,"NCBI35, Ensembl release 27, Dec 2004",ENSG00000123080,CDKN2C,,Ensembl release 61 gene symbol,"GRCh37, Ensembl release 61, Feb 2011, Gene Symbols from Ensembl release 61 or 81",,,dapi: DNA;vsvg-cfp: CFP-tsO45G ;pm-647: cell surface tsO45G,,"cyclin-dependent kinase inhibitor 2C (p18, inhibits CDK4)",1.8797,yes,yes,multiple replicates of reagent,strong inhibition of secretion,strong decrease in rate of protein secretion,CMPO_0000319,0305-04--2007-04-14,l15
2701,305,280,606346,Homo sapiens,NCBITaxon,NCBITaxon_9606,HeLa,EFO,EFO_0001185,Q103860,CCGUAUCGUAAGCAGUACUtt,AGUACUGCUUACGAUACGGtt,"NCBI35, Ensembl release 27, Dec 2004",,,,no perfect match to a gene transcript in Ensembl 61,"GRCh37, Ensembl release 61, Feb 2011, Gene Symbols from Ensembl release 61 or 81",,,dapi: DNA;vsvg-cfp: CFP-tsO45G ;pm-647: cell surface tsO45G,,,,,,,,,,0305-04--2007-04-14,l16
2701,305,281,606429,Homo sapiens,NCBITaxon,NCBITaxon_9606,HeLa,EFO,EFO_0001185,SI03056088,UGAACCGUUUAGGUGGCUGtg,CAGCCACCUAAACGGUUCAtt,"NCBI35, Ensembl release 27, Dec 2004",ENSG00000129355,CDKN2D,,Ensembl release 61 gene symbol,"GRCh37, Ensembl release 61, Feb 2011, Gene Symbols from Ensembl release 61 or 81",,,dapi: DNA;vsvg-cfp: CFP-tsO45G ;pm-647: cell surface tsO45G,,"cyclin-dependent kinase inhibitor 2D (p19, inhibits CDK4)",2.1838,yes,yes,multiple replicates of reagent,strong inhibition of secretion,strong decrease in rate of protein secretion,CMPO_0000319,0305-04--2007-04-14,l17
2701,305,282,606308,Homo sapiens,NCBITaxon,NCBITaxon_9606,HeLa,EFO,EFO_0001185,SI02665628,UUGAUACAGAUCUUGAUUGtg,CAAUCAAGAUCUGUAUCAAtt,"NCBI35, Ensembl release 27, Dec 2004",ENSG00000100526,CDKN3,,Ensembl release 61 gene symbol,"GRCh37, Ensembl release 61, Feb 2011, Gene Symbols from Ensembl release 61 or 81",,,dapi: DNA;vsvg-cfp: CFP-tsO45G ;pm-647: cell surface tsO45G,,cyclin-dependent kinase inhibitor 3 (CDK2-associated dual specificity phosphatase),1.0545,yes,yes,multiple replicates of reagent,strong inhibition of secretion,strong decrease in rate of protein secretion,CMPO_0000319,0305-04--2007-04-14,l18
2701,305,283,606522,Homo sapiens,NCBITaxon,NCBITaxon_9606,HeLa,EFO,EFO_0001185,SI00343014,UUUGCUGUGUUGUAAGAUGtt,CAUCUUACAACACAGCAAAtt,"NCBI35, Ensembl release 27, Dec 2004",ENSG00000069998,CECR5,,Ensembl release 81 gene symbol added by IDR curator,"GRCh37, Ensembl release 61, Feb 2011, Gene Symbols from Ensembl release 61 or 81",,,dapi: DNA;vsvg-cfp: CFP-tsO45G ;pm-647: cell surface tsO45G,,,,,,,,,,0305-04--2007-04-14,l19