Plate,Plate Group,Well Number,Well,Characteristics [Organism],Term Source 1 REF,Term Source 1 Accession,Characteristics [Cell Line],Term Source 2 REF,Term Source 2 Accession,siRNA Identifier,Antisense Sequence,Sense Sequence,Reagent Design Gene Annotation Build,Gene Identifier,Gene Symbol,Gene Symbol Synonyms,Gene Annotation Comments,Analysis Gene Annotation Build,Control Type,Control Comments,Channels,Comments,Gene Description,Deviation,Overall Strong Inhibitor Gene Hit,Has Phenotype,Phenotype Annotation Level,Phenotype 1,Phenotype 1 Term Name,Phenotype 1 Term Accession,Plate Name,Well Name
2697,305,1,605030,,,,,,,,,,,,,,,,empty well,,dapi: DNA;vsvg-cfp: CFP-tsO45G ;pm-647: cell surface tsO45G,,,,,,,,,,0305-01--2007-04-03,a1
2697,305,2,604715,Homo sapiens,NCBITaxon,NCBITaxon_9606,HeLa,EFO,EFO_0001185,SI00289037,UAACUCUCUCUAUUAAGGGtt,CCCUUAAUAGAGAGAGUUAtt,"NCBI35, Ensembl release 27, Dec 2004",ENSG00000109576,AADAT,,Ensembl release 61 gene symbol,"GRCh37, Ensembl release 61, Feb 2011, Gene Symbols from Ensembl release 61 or 81",,,dapi: DNA;vsvg-cfp: CFP-tsO45G ;pm-647: cell surface tsO45G,,,,,,,,,,0305-01--2007-04-03,a2
2697,305,3,604933,Homo sapiens,NCBITaxon,NCBITaxon_9606,HeLa,EFO,EFO_0001185,SI02224586,UUCAUCAGGUUUACCACCUgg,AGGUGGUAAACCUGAUGAAtt,"NCBI35, Ensembl release 27, Dec 2004",ENSG00000115977,AAK1,,Ensembl release 81 gene symbol added by IDR curator,"GRCh37, Ensembl release 61, Feb 2011, Gene Symbols from Ensembl release 61 or 81",,,dapi: DNA;vsvg-cfp: CFP-tsO45G ;pm-647: cell surface tsO45G,,,,,,,,,,0305-01--2007-04-03,a3
2697,305,4,604821,Homo sapiens,NCBITaxon,NCBITaxon_9606,HeLa,EFO,EFO_0001185,SI00289219,UUCCGUAUGGAAUCAUCGGga,CCGAUGAUUCCAUACGGAAtt,"NCBI35, Ensembl release 27, Dec 2004",ENSG00000183044,ABAT,,Ensembl release 61 gene symbol,"GRCh37, Ensembl release 61, Feb 2011, Gene Symbols from Ensembl release 61 or 81",,,dapi: DNA;vsvg-cfp: CFP-tsO45G ;pm-647: cell surface tsO45G,,4-aminobutyrate aminotransferase,2.4305,yes,yes,multiple replicates of reagent,strong inhibition of secretion,strong decrease in rate of protein secretion,CMPO_0000319,0305-01--2007-04-03,a4
2697,305,5,604961,Homo sapiens,NCBITaxon,NCBITaxon_9606,HeLa,EFO,EFO_0001185,SI00078085,UACUGUUCGUUGUACAUCCag,GGAUGUACAACGAACAGUAtt,"NCBI35, Ensembl release 27, Dec 2004",ENSG00000165029,ABCA1,,Ensembl release 61 gene symbol,"GRCh37, Ensembl release 61, Feb 2011, Gene Symbols from Ensembl release 61 or 81",,,dapi: DNA;vsvg-cfp: CFP-tsO45G ;pm-647: cell surface tsO45G,,"ATP-binding cassette, sub-family A (ABC1), member 1",1.3921,yes,yes,multiple replicates of reagent,strong inhibition of secretion,strong decrease in rate of protein secretion,CMPO_0000319,0305-01--2007-04-03,a5
2697,305,6,604987,Homo sapiens,NCBITaxon,NCBITaxon_9606,HeLa,EFO,EFO_0001185,SI00289331,UUGAUGAUGAGUUAUAUUCtg,GAAUAUAACUCAUCAUCAAtt,"NCBI35, Ensembl release 27, Dec 2004",ENSG00000179869,ABCA13,,Ensembl release 81 gene symbol added by IDR curator,"GRCh37, Ensembl release 61, Feb 2011, Gene Symbols from Ensembl release 61 or 81",,,dapi: DNA;vsvg-cfp: CFP-tsO45G ;pm-647: cell surface tsO45G,,,,,,,,,,0305-01--2007-04-03,a6
2697,305,7,604974,Homo sapiens,NCBITaxon,NCBITaxon_9606,HeLa,EFO,EFO_0001185,SI00146419,UUUGUUGACGGGUACCAGCag,GCUGGUACCCGUCAACAAAtt,"NCBI35, Ensembl release 27, Dec 2004",ENSG00000124574,ABCC10,,Ensembl release 81 gene symbol added by IDR curator,"GRCh37, Ensembl release 61, Feb 2011, Gene Symbols from Ensembl release 61 or 81",,,dapi: DNA;vsvg-cfp: CFP-tsO45G ;pm-647: cell surface tsO45G,,,,,,,,,,0305-01--2007-04-03,a7
2697,305,8,604690,Homo sapiens,NCBITaxon,NCBITaxon_9606,HeLa,EFO,EFO_0001185,SI00022981,UUAGCAGGUGACCAAUGGGtg,CCCAUUGGUCACCUGCUAAtt,"NCBI35, Ensembl release 27, Dec 2004",ENSG00000091262,ABCC6,,Ensembl release 61 gene symbol,"GRCh37, Ensembl release 61, Feb 2011, Gene Symbols from Ensembl release 61 or 81",,,dapi: DNA;vsvg-cfp: CFP-tsO45G ;pm-647: cell surface tsO45G,,"ATP-binding cassette, sub-family C (CFTR/MRP), member 6",2.488,yes,yes,multiple replicates of reagent,strong inhibition of secretion,strong decrease in rate of protein secretion,CMPO_0000319,0305-01--2007-04-03,a8
2697,305,9,604791,Homo sapiens,NCBITaxon,NCBITaxon_9606,HeLa,EFO,EFO_0001185,SI00289905,UUGUUAAACACGACAGCCUgg,AGGCUGUCGUGUUUAACAAtt,"NCBI35, Ensembl release 27, Dec 2004",ENSG00000143994,ABHD1,,Ensembl release 61 gene symbol,"GRCh37, Ensembl release 61, Feb 2011, Gene Symbols from Ensembl release 61 or 81",,,dapi: DNA;vsvg-cfp: CFP-tsO45G ;pm-647: cell surface tsO45G,,abhydrolase domain containing 1,2.4407,yes,yes,multiple replicates of reagent,strong inhibition of secretion,strong decrease in rate of protein secretion,CMPO_0000319,0305-01--2007-04-03,a9
2697,305,10,605036,Homo sapiens,NCBITaxon,NCBITaxon_9606,HeLa,EFO,EFO_0001185,SI00317975,UAAUGUACCAAUUUAUUGCat,GCAAUAAAUUGGUACAUUAtt,"NCBI35, Ensembl release 27, Dec 2004",ENSG00000139826,ABHD13,,Ensembl release 61 gene symbol,"GRCh37, Ensembl release 61, Feb 2011, Gene Symbols from Ensembl release 61 or 81",,,dapi: DNA;vsvg-cfp: CFP-tsO45G ;pm-647: cell surface tsO45G,,abhydrolase domain containing 13,2.8163,yes,yes,multiple replicates of reagent,strong inhibition of secretion,strong decrease in rate of protein secretion,CMPO_0000319,0305-01--2007-04-03,a10
2697,305,11,604851,Homo sapiens,NCBITaxon,NCBITaxon_9606,HeLa,EFO,EFO_0001185,SI00290010,UUAAGGUGUGAUAUAGACGta,CGUCUAUAUCACACCUUAAtt,"NCBI35, Ensembl release 27, Dec 2004",ENSG00000011198,ABHD5,,Ensembl release 61 gene symbol,"GRCh37, Ensembl release 61, Feb 2011, Gene Symbols from Ensembl release 61 or 81",,,dapi: DNA;vsvg-cfp: CFP-tsO45G ;pm-647: cell surface tsO45G,,abhydrolase domain containing 5,2.9809,yes,yes,multiple replicates of reagent,strong inhibition of secretion,strong decrease in rate of protein secretion,CMPO_0000319,0305-01--2007-04-03,a11
2697,305,12,604674,Homo sapiens,NCBITaxon,NCBITaxon_9606,HeLa,EFO,EFO_0001185,,,,"NCBI35, Ensembl release 27, Dec 2004",,,,,"GRCh37, Ensembl release 61, Feb 2011, Gene Symbols from Ensembl release 61 or 81",,,dapi: DNA;vsvg-cfp: CFP-tsO45G ;pm-647: cell surface tsO45G,annotation not available,,,,,,,,,0305-01--2007-04-03,a12
2697,305,13,604937,Homo sapiens,NCBITaxon,NCBITaxon_9606,HeLa,EFO,EFO_0001185,SI00290227,UUCAAUGUCAUAAAUUGCCtt,GGCAAUUUAUGACAUUGAAtt,"NCBI35, Ensembl release 27, Dec 2004",ENSG00000099204,ABLIM1,,Ensembl release 81 gene symbol added by IDR curator,"GRCh37, Ensembl release 61, Feb 2011, Gene Symbols from Ensembl release 61 or 81",,,dapi: DNA;vsvg-cfp: CFP-tsO45G ;pm-647: cell surface tsO45G,,,,,,,,,,0305-01--2007-04-03,a13
2697,305,14,604976,Homo sapiens,NCBITaxon,NCBITaxon_9606,HeLa,EFO,EFO_0001185,Q24546,AUUAGGAUGUUGAAGAUCCtt,GGAUCUUCAACAUCCUAAUtt,"NCBI35, Ensembl release 27, Dec 2004",,,,"siRNA original target COPB1, siRNA matched to multiple genes (ENSG00000129083;ENSG00000129084)","GRCh37, Ensembl release 61, Feb 2011, Gene Symbols from Ensembl release 61 or 81",positive control,,dapi: DNA;vsvg-cfp: CFP-tsO45G ;pm-647: cell surface tsO45G,,,,,,,,,,0305-01--2007-04-03,a14
2697,305,15,604724,Homo sapiens,NCBITaxon,NCBITaxon_9606,HeLa,EFO,EFO_0001185,SI00290269,UUACUUUAAAGAUAUUGUGta,CACAAUAUCUUUAAAGUAAtt,"NCBI35, Ensembl release 27, Dec 2004",ENSG00000163995,ABLIM2,,Ensembl release 81 gene symbol added by IDR curator,"GRCh37, Ensembl release 61, Feb 2011, Gene Symbols from Ensembl release 61 or 81",,,dapi: DNA;vsvg-cfp: CFP-tsO45G ;pm-647: cell surface tsO45G,,,,,,,,,,0305-01--2007-04-03,a15
2697,305,16,604691,Homo sapiens,NCBITaxon,NCBITaxon_9606,HeLa,EFO,EFO_0001185,SI00290521,UUAAUGUCUUCUAUAGUUGag,CAACUAUAGAAGACAUUAAtt,"NCBI35, Ensembl release 27, Dec 2004",ENSG00000167315,ACAA2,,Ensembl release 61 gene symbol,"GRCh37, Ensembl release 61, Feb 2011, Gene Symbols from Ensembl release 61 or 81",,,dapi: DNA;vsvg-cfp: CFP-tsO45G ;pm-647: cell surface tsO45G,,acetyl-Coenzyme A acyltransferase 2 (mitochondrial 3-oxoacyl-Coenzyme A thiolase),2.259,yes,yes,multiple replicates of reagent,strong inhibition of secretion,strong decrease in rate of protein secretion,CMPO_0000319,0305-01--2007-04-03,a16
2697,305,17,604932,Homo sapiens,NCBITaxon,NCBITaxon_9606,HeLa,EFO,EFO_0001185,SI02653784,UUCUAUGUUGCUCCCAUGGcg,CCAUGGGAGCAACAUAGAAtt,"NCBI35, Ensembl release 27, Dec 2004",ENSG00000120437,ACAT2,,Ensembl release 81 gene symbol added by IDR curator,"GRCh37, Ensembl release 61, Feb 2011, Gene Symbols from Ensembl release 61 or 81",,,dapi: DNA;vsvg-cfp: CFP-tsO45G ;pm-647: cell surface tsO45G,,,,,,,,,,0305-01--2007-04-03,a17
2697,305,18,605048,Homo sapiens,NCBITaxon,NCBITaxon_9606,HeLa,EFO,EFO_0001185,SI00290801,UUGGAUUGGGUGUAAGGCCgg,GGCCUUACACCCAAUCCAAtt,"NCBI35, Ensembl release 27, Dec 2004",ENSG00000135847,,,,"GRCh37, Ensembl release 61, Feb 2011, Gene Symbols from Ensembl release 61 or 81",,,dapi: DNA;vsvg-cfp: CFP-tsO45G ;pm-647: cell surface tsO45G,,,,,,,,,,0305-01--2007-04-03,a18
2697,305,19,605017,Homo sapiens,NCBITaxon,NCBITaxon_9606,HeLa,EFO,EFO_0001185,SI00013664,UUGUCUUUGCUGAAGCCUGgg,CAGGCUUCAGCAAAGACAAtt,"NCBI35, Ensembl release 27, Dec 2004",ENSG00000087085,ACHE,,Ensembl release 61 gene symbol,"GRCh37, Ensembl release 61, Feb 2011, Gene Symbols from Ensembl release 61 or 81",,,dapi: DNA;vsvg-cfp: CFP-tsO45G ;pm-647: cell surface tsO45G,,acetylcholinesterase,1.6934,yes,yes,multiple replicates of reagent,strong inhibition of secretion,strong decrease in rate of protein secretion,CMPO_0000319,0305-01--2007-04-03,a19
2697,305,20,604891,Homo sapiens,NCBITaxon,NCBITaxon_9606,HeLa,EFO,EFO_0001185,Q103860,CCGUAUCGUAAGCAGUACUtt,AGUACUGCUUACGAUACGGtt,"NCBI35, Ensembl release 27, Dec 2004",,,,no perfect match to a gene transcript in Ensembl 61,"GRCh37, Ensembl release 61, Feb 2011, Gene Symbols from Ensembl release 61 or 81",,,dapi: DNA;vsvg-cfp: CFP-tsO45G ;pm-647: cell surface tsO45G,,,,,,,,,,0305-01--2007-04-03,a20
2697,305,21,604762,Homo sapiens,NCBITaxon,NCBITaxon_9606,HeLa,EFO,EFO_0001185,SI00290990,UUAUAUAUUCCUCAUAGGCag,GCCUAUGAGGAAUAUAUAAtt,"NCBI35, Ensembl release 27, Dec 2004",ENSG00000168306,ACOX2,,Ensembl release 81 gene symbol added by IDR curator,"GRCh37, Ensembl release 61, Feb 2011, Gene Symbols from Ensembl release 61 or 81",,,dapi: DNA;vsvg-cfp: CFP-tsO45G ;pm-647: cell surface tsO45G,,,,,,,,,,0305-01--2007-04-03,a21
2697,305,22,604872,Homo sapiens,NCBITaxon,NCBITaxon_9606,HeLa,EFO,EFO_0001185,SI00291053,UUGUCAAAUAUUAAUAUCCca,GGAUAUUAAUAUUUGACAAtt,"NCBI35, Ensembl release 27, Dec 2004",ENSG00000153093,ACOXL,,Ensembl release 61 gene symbol,"GRCh37, Ensembl release 61, Feb 2011, Gene Symbols from Ensembl release 61 or 81",,,dapi: DNA;vsvg-cfp: CFP-tsO45G ;pm-647: cell surface tsO45G,,acyl-Coenzyme A oxidase-like,2.3054,yes,yes,multiple replicates of reagent,strong inhibition of secretion,strong decrease in rate of protein secretion,CMPO_0000319,0305-01--2007-04-03,a22
2697,305,23,604725,Homo sapiens,NCBITaxon,NCBITaxon_9606,HeLa,EFO,EFO_0001185,SI00114240,UUGACGUGUUUGCUGUAGGtg,CCUACAGCAAACACGUCAAtt,"NCBI35, Ensembl release 27, Dec 2004",ENSG00000077080,ACTL6B,,Ensembl release 61 gene symbol,"GRCh37, Ensembl release 61, Feb 2011, Gene Symbols from Ensembl release 61 or 81",,,dapi: DNA;vsvg-cfp: CFP-tsO45G ;pm-647: cell surface tsO45G,,actin-like 6B,2.6495,yes,yes,multiple replicates of reagent,strong inhibition of secretion,strong decrease in rate of protein secretion,CMPO_0000319,0305-01--2007-04-03,a23
2697,305,24,604986,Homo sapiens,NCBITaxon,NCBITaxon_9606,HeLa,EFO,EFO_0001185,SI02664298,UCCUCACUUAAUUUCAGCCgg,GGCUGAAAUUAAGUGAGGAtt,"NCBI35, Ensembl release 27, Dec 2004",ENSG00000115091,ACTR3,,Ensembl release 61 gene symbol,"GRCh37, Ensembl release 61, Feb 2011, Gene Symbols from Ensembl release 61 or 81",,,dapi: DNA;vsvg-cfp: CFP-tsO45G ;pm-647: cell surface tsO45G,,ARP3 actin-related protein 3 homolog (yeast),3.2457,yes,yes,multiple replicates of reagent,strong inhibition of secretion,strong decrease in rate of protein secretion,CMPO_0000319,0305-01--2007-04-03,a24
2697,305,25,605022,Homo sapiens,NCBITaxon,NCBITaxon_9606,HeLa,EFO,EFO_0001185,SI03022551,AUGAUAGUUAAUGACAAGGaa,CCUUGUCAUUAACUAUCAUtt,"NCBI35, Ensembl release 27, Dec 2004",ENSG00000135503,ACVR1B,,Ensembl release 81 gene symbol added by IDR curator,"GRCh37, Ensembl release 61, Feb 2011, Gene Symbols from Ensembl release 61 or 81",,,dapi: DNA;vsvg-cfp: CFP-tsO45G ;pm-647: cell surface tsO45G,,,,,,,,,,0305-01--2007-04-03,b1
2697,305,26,604705,Homo sapiens,NCBITaxon,NCBITaxon_9606,HeLa,EFO,EFO_0001185,SI02625322,AUGGAUGUCCACAUGACCGta,CGGUCAUGUGGACAUCCAUtt,"NCBI35, Ensembl release 27, Dec 2004",ENSG00000114739,ACVR2B,,Ensembl release 81 gene symbol added by IDR curator,"GRCh37, Ensembl release 61, Feb 2011, Gene Symbols from Ensembl release 61 or 81",,,dapi: DNA;vsvg-cfp: CFP-tsO45G ;pm-647: cell surface tsO45G,,,,,,,,,,0305-01--2007-04-03,b2
2697,305,27,604952,Homo sapiens,NCBITaxon,NCBITaxon_9606,HeLa,EFO,EFO_0001185,SI02758392,UUCUUCAUGUCCUCAAAGCtg,GCUUUGAGGACAUGAAGAAtt,"NCBI35, Ensembl release 27, Dec 2004",ENSG00000139567,ACVRL1,,Ensembl release 81 gene symbol added by IDR curator,"GRCh37, Ensembl release 61, Feb 2011, Gene Symbols from Ensembl release 61 or 81",,,dapi: DNA;vsvg-cfp: CFP-tsO45G ;pm-647: cell surface tsO45G,,,,,,,,,,0305-01--2007-04-03,b3
2697,305,28,604893,Homo sapiens,NCBITaxon,NCBITaxon_9606,HeLa,EFO,EFO_0001185,SI00037072,UUGUAUAUCACAUCGGCCAgg,UGGCCGAUGUGAUAUACAAtt,"NCBI35, Ensembl release 27, Dec 2004",ENSG00000073670,ADAM11,,Ensembl release 61 gene symbol,"GRCh37, Ensembl release 61, Feb 2011, Gene Symbols from Ensembl release 61 or 81",,,dapi: DNA;vsvg-cfp: CFP-tsO45G ;pm-647: cell surface tsO45G,,ADAM metallopeptidase domain 11,1.8185,yes,yes,multiple replicates of reagent,strong inhibition of secretion,strong decrease in rate of protein secretion,CMPO_0000319,0305-01--2007-04-03,b4
2697,305,29,604773,Homo sapiens,NCBITaxon,NCBITaxon_9606,HeLa,EFO,EFO_0001185,SI00052346,UUGACCGUUGCAAUAAAUGag,CAUUUAUUGCAACGGUCAAtt,"NCBI35, Ensembl release 27, Dec 2004",ENSG00000148848,ADAM12,,Ensembl release 81 gene symbol added by IDR curator,"GRCh37, Ensembl release 61, Feb 2011, Gene Symbols from Ensembl release 61 or 81",,,dapi: DNA;vsvg-cfp: CFP-tsO45G ;pm-647: cell surface tsO45G,,,,,,,,,,0305-01--2007-04-03,b5
2697,305,30,604820,Homo sapiens,NCBITaxon,NCBITaxon_9606,HeLa,EFO,EFO_0001185,Q111531,CAAUAUGUCUCUAUGCCGCtg,GCGGCAUAGAGACAUAUUGtt,"NCBI35, Ensembl release 27, Dec 2004",ENSG00000108587,GOSR1,,Ensembl release 81 gene symbol added by IDR curator,"GRCh37, Ensembl release 61, Feb 2011, Gene Symbols from Ensembl release 61 or 81",positive control,,dapi: DNA;vsvg-cfp: CFP-tsO45G ;pm-647: cell surface tsO45G,,,,,,,,,,0305-01--2007-04-03,b6
2697,305,31,604950,Homo sapiens,NCBITaxon,NCBITaxon_9606,HeLa,EFO,EFO_0001185,SI00056245,UACAAUACCACAGUGACCGaa,CGGUCACUGUGGUAUUGUAtt,"NCBI35, Ensembl release 27, Dec 2004",ENSG00000134007,ADAM20,,Ensembl release 81 gene symbol added by IDR curator,"GRCh37, Ensembl release 61, Feb 2011, Gene Symbols from Ensembl release 61 or 81",,,dapi: DNA;vsvg-cfp: CFP-tsO45G ;pm-647: cell surface tsO45G,,,,,,,,,,0305-01--2007-04-03,b7
2697,305,32,604985,Homo sapiens,NCBITaxon,NCBITaxon_9606,HeLa,EFO,EFO_0001185,SI00291998,UAGGUGGACGACAUAUUCCtg,GGAAUAUGUCGUCCACCUAtt,"NCBI35, Ensembl release 27, Dec 2004",ENSG00000139985,ADAM21,,Ensembl release 61 gene symbol,"GRCh37, Ensembl release 61, Feb 2011, Gene Symbols from Ensembl release 61 or 81",,,dapi: DNA;vsvg-cfp: CFP-tsO45G ;pm-647: cell surface tsO45G,,ADAM metallopeptidase domain 21,1.5824,yes,yes,multiple replicates of reagent,strong inhibition of secretion,strong decrease in rate of protein secretion,CMPO_0000319,0305-01--2007-04-03,b8
2697,305,33,604923,Homo sapiens,NCBITaxon,NCBITaxon_9606,HeLa,EFO,EFO_0001185,SI00131089,UCAAUGUUAAAUACACCUCgg,GAGGUGUAUUUAACAUUGAtt,"NCBI35, Ensembl release 27, Dec 2004",ENSG00000134249,ADAM30,,Ensembl release 81 gene symbol added by IDR curator,"GRCh37, Ensembl release 61, Feb 2011, Gene Symbols from Ensembl release 61 or 81",,,dapi: DNA;vsvg-cfp: CFP-tsO45G ;pm-647: cell surface tsO45G,,,,,,,,,,0305-01--2007-04-03,b9
2697,305,34,604822,Homo sapiens,NCBITaxon,NCBITaxon_9606,HeLa,EFO,EFO_0001185,SI00151739,UAGCCAACCAUGAUCAAGCgg,GCUUGAUCAUGGUUGGCUAtt,"NCBI35, Ensembl release 27, Dec 2004",ENSG00000138316,ADAMTS14,,Ensembl release 61 gene symbol,"GRCh37, Ensembl release 61, Feb 2011, Gene Symbols from Ensembl release 61 or 81",,,dapi: DNA;vsvg-cfp: CFP-tsO45G ;pm-647: cell surface tsO45G,,"ADAM metallopeptidase with thrombospondin type 1 motif, 14",2.623,yes,yes,multiple replicates of reagent,strong inhibition of secretion,strong decrease in rate of protein secretion,CMPO_0000319,0305-01--2007-04-03,b10
2697,305,35,604672,Homo sapiens,NCBITaxon,NCBITaxon_9606,HeLa,EFO,EFO_0001185,SI00104384,UACACUUGCACUCCACAGGtg,CCUGUGGAGUGCAAGUGUAtt,"NCBI35, Ensembl release 27, Dec 2004",ENSG00000136378,ADAMTS7,,Ensembl release 61 gene symbol,"GRCh37, Ensembl release 61, Feb 2011, Gene Symbols from Ensembl release 61 or 81",,,dapi: DNA;vsvg-cfp: CFP-tsO45G ;pm-647: cell surface tsO45G,,"ADAM metallopeptidase with thrombospondin type 1 motif, 7",3.4153,yes,yes,multiple replicates of reagent,strong inhibition of secretion,strong decrease in rate of protein secretion,CMPO_0000319,0305-01--2007-04-03,b11
2697,305,36,604801,Homo sapiens,NCBITaxon,NCBITaxon_9606,HeLa,EFO,EFO_0001185,SI02643970,UUGGUGUAGAAGUUCAGUGtt,CACUGAACUUCUACACCAAtt,"NCBI35, Ensembl release 27, Dec 2004",ENSG00000163638,ADAMTS9,,Ensembl release 81 gene symbol added by IDR curator,"GRCh37, Ensembl release 61, Feb 2011, Gene Symbols from Ensembl release 61 or 81",,,dapi: DNA;vsvg-cfp: CFP-tsO45G ;pm-647: cell surface tsO45G,,,,,,,,,,0305-01--2007-04-03,b12
2697,305,37,604900,Homo sapiens,NCBITaxon,NCBITaxon_9606,HeLa,EFO,EFO_0001185,SI00292320,UUAGGCUGAGAGAAUCUCCtt,GGAGAUUCUCUCAGCCUAAtt,"NCBI35, Ensembl release 27, Dec 2004",ENSG00000160710,ADAR,,Ensembl release 81 gene symbol added by IDR curator,"GRCh37, Ensembl release 61, Feb 2011, Gene Symbols from Ensembl release 61 or 81",,,dapi: DNA;vsvg-cfp: CFP-tsO45G ;pm-647: cell surface tsO45G,,,,,,,,,,0305-01--2007-04-03,b13
2697,305,38,604925,Homo sapiens,NCBITaxon,NCBITaxon_9606,HeLa,EFO,EFO_0001185,SI02780043,UUGUGGAUCAACUGCAACGga,CGUUGCAGUUGAUCCACAAtt,"NCBI35, Ensembl release 27, Dec 2004",ENSG00000147872,PLIN2,,Ensembl release 81 gene symbol added by IDR curator,"GRCh37, Ensembl release 61, Feb 2011, Gene Symbols from Ensembl release 61 or 81",,,dapi: DNA;vsvg-cfp: CFP-tsO45G ;pm-647: cell surface tsO45G,,,,,,,,,,0305-01--2007-04-03,b14
2697,305,39,605040,Homo sapiens,NCBITaxon,NCBITaxon_9606,HeLa,EFO,EFO_0001185,Q103860,CCGUAUCGUAAGCAGUACUtt,AGUACUGCUUACGAUACGGtt,"NCBI35, Ensembl release 27, Dec 2004",,,,no perfect match to a gene transcript in Ensembl 61,"GRCh37, Ensembl release 61, Feb 2011, Gene Symbols from Ensembl release 61 or 81",,,dapi: DNA;vsvg-cfp: CFP-tsO45G ;pm-647: cell surface tsO45G,,,,,,,,,,0305-01--2007-04-03,b15
2697,305,40,604963,Homo sapiens,NCBITaxon,NCBITaxon_9606,HeLa,EFO,EFO_0001185,SI00022267,UAUCUAUCCCAAUGCAUCCaa,GGAUGCAUUGGGAUAGAUAtt,"NCBI35, Ensembl release 27, Dec 2004",ENSG00000156110,ADK,,Ensembl release 61 gene symbol,"GRCh37, Ensembl release 61, Feb 2011, Gene Symbols from Ensembl release 61 or 81",,,dapi: DNA;vsvg-cfp: CFP-tsO45G ;pm-647: cell surface tsO45G,,adenosine kinase,2.2633,yes,yes,multiple replicates of reagent,strong inhibition of secretion,strong decrease in rate of protein secretion,CMPO_0000319,0305-01--2007-04-03,b16
2697,305,41,604884,Homo sapiens,NCBITaxon,NCBITaxon_9606,HeLa,EFO,EFO_0001185,SI00013846,AUGAUUACUGAACCUACCCtt,GGGUAGGUUCAGUAAUCAUtt,"NCBI35, Ensembl release 27, Dec 2004",ENSG00000163485,ADORA1,,Ensembl release 81 gene symbol added by IDR curator,"GRCh37, Ensembl release 61, Feb 2011, Gene Symbols from Ensembl release 61 or 81",,,dapi: DNA;vsvg-cfp: CFP-tsO45G ;pm-647: cell surface tsO45G,,,,,,,,,,0305-01--2007-04-03,b17
2697,305,42,604905,Homo sapiens,NCBITaxon,NCBITaxon_9606,HeLa,EFO,EFO_0001185,SI00013895,UUCACAACCGAAUUGGUGUgg,ACACCAAUUCGGUUGUGAAtt,"NCBI35, Ensembl release 27, Dec 2004",,,,siRNA matched to multiple genes (ENSG00000100014;ENSG00000128271),"GRCh37, Ensembl release 61, Feb 2011, Gene Symbols from Ensembl release 61 or 81",,,dapi: DNA;vsvg-cfp: CFP-tsO45G ;pm-647: cell surface tsO45G,,,,,,,,,,0305-01--2007-04-03,b18
2697,305,43,605031,Homo sapiens,NCBITaxon,NCBITaxon_9606,HeLa,EFO,EFO_0001185,SI02624139,UUUAUUUCUAAGCGGCGGGag,CCCGCCGCUUAGAAAUAAAtt,"NCBI35, Ensembl release 27, Dec 2004",ENSG00000150594,ADRA2A,,Ensembl release 81 gene symbol added by IDR curator,"GRCh37, Ensembl release 61, Feb 2011, Gene Symbols from Ensembl release 61 or 81",,,dapi: DNA;vsvg-cfp: CFP-tsO45G ;pm-647: cell surface tsO45G,,,,,,,,,,0305-01--2007-04-03,b19
2697,305,44,604743,Homo sapiens,NCBITaxon,NCBITaxon_9606,HeLa,EFO,EFO_0001185,SI00022302,UAAUAGUCCAUGUCAUCGUag,ACGAUGACAUGGACUAUUAtt,"NCBI35, Ensembl release 27, Dec 2004",ENSG00000106624,AEBP1,,Ensembl release 61 gene symbol,"GRCh37, Ensembl release 61, Feb 2011, Gene Symbols from Ensembl release 61 or 81",,,dapi: DNA;vsvg-cfp: CFP-tsO45G ;pm-647: cell surface tsO45G,,AE binding protein 1,1.0996,yes,yes,multiple replicates of reagent,strong inhibition of secretion,strong decrease in rate of protein secretion,CMPO_0000319,0305-01--2007-04-03,b20
2697,305,45,604984,Homo sapiens,NCBITaxon,NCBITaxon_9606,HeLa,EFO,EFO_0001185,SI00293314,UUGGAGACGAUGACACAGGga,CCUGUGUCAUCGUCUCCAAtt,"NCBI35, Ensembl release 27, Dec 2004",ENSG00000169692,AGPAT2,,Ensembl release 81 gene symbol added by IDR curator,"GRCh37, Ensembl release 61, Feb 2011, Gene Symbols from Ensembl release 61 or 81",,,dapi: DNA;vsvg-cfp: CFP-tsO45G ;pm-647: cell surface tsO45G,,,,,,,,,,0305-01--2007-04-03,b21
2697,305,46,604837,Homo sapiens,NCBITaxon,NCBITaxon_9606,HeLa,EFO,EFO_0001185,Q120368,AAGCUUGAUUGUUUUCCCGtc,CGGGAAAACAAUCAAGCUUtt,"NCBI35, Ensembl release 27, Dec 2004",ENSG00000138069,RAB1A,,Ensembl release 81 gene symbol added by IDR curator,"GRCh37, Ensembl release 61, Feb 2011, Gene Symbols from Ensembl release 61 or 81",,,dapi: DNA;vsvg-cfp: CFP-tsO45G ;pm-647: cell surface tsO45G,,,,,,,,,,0305-01--2007-04-03,b22
2697,305,47,604768,Homo sapiens,NCBITaxon,NCBITaxon_9606,HeLa,EFO,EFO_0001185,SI00293370,UUAUUCAGAAAUAAAUAACta,GUUAUUUAUUUCUGAAUAAtt,"NCBI35, Ensembl release 27, Dec 2004",ENSG00000026652,AGPAT4,,Ensembl release 81 gene symbol added by IDR curator,"GRCh37, Ensembl release 61, Feb 2011, Gene Symbols from Ensembl release 61 or 81",,,dapi: DNA;vsvg-cfp: CFP-tsO45G ;pm-647: cell surface tsO45G,,,,,,,,,,0305-01--2007-04-03,b23
2697,305,48,604733,Homo sapiens,NCBITaxon,NCBITaxon_9606,HeLa,EFO,EFO_0001185,SI02778454,UCUUGGUUCAGGCAAUCCCtg,GGGAUUGCCUGAACCAAGAtt,"NCBI35, Ensembl release 27, Dec 2004",ENSG00000177674,AGTRAP,,Ensembl release 61 gene symbol,"GRCh37, Ensembl release 61, Feb 2011, Gene Symbols from Ensembl release 61 or 81",,,dapi: DNA;vsvg-cfp: CFP-tsO45G ;pm-647: cell surface tsO45G,,angiotensin II receptor-associated protein,3.215,yes,yes,multiple replicates of reagent,strong inhibition of secretion,strong decrease in rate of protein secretion,CMPO_0000319,0305-01--2007-04-03,b24
2697,305,49,604962,Homo sapiens,NCBITaxon,NCBITaxon_9606,HeLa,EFO,EFO_0001185,SI02779266,UUAAACUUCAGGAUGUUCCtc,GGAACAUCCUGAAGUUUAAtt,"NCBI35, Ensembl release 27, Dec 2004",ENSG00000175309,PHYKPL,,Ensembl release 81 gene symbol added by IDR curator,"GRCh37, Ensembl release 61, Feb 2011, Gene Symbols from Ensembl release 61 or 81",,,dapi: DNA;vsvg-cfp: CFP-tsO45G ;pm-647: cell surface tsO45G,,,,,,,,,,0305-01--2007-04-03,c1